program: Gaussian 16
title: f_quinoline_h2
version: ES64L-G16RevC.02
method: RwB97XD
basis: GenECP
operation: Freq
keyword: #N
keyword: Geom=AllCheck
keyword: Guess=TCheck
keyword: SCRF=Check
keyword: GenChk
keyword: RwB97XD/GenECP
keyword: Freq
converged: YES YES YES YES
title: Mulliken charges:
elementType: C C C C C C H C H H C C H H H N B F F H H
charge: 0.066057 -0.912406 -0.822392 0.505859 -0.403021 -0.459846 0.264856 1.280569 0.211500 0.236398 -1.012668 0.174161 0.286500 0.263196 0.293378 0.016632 0.288382 -0.275918 -0.348354 -0.036038 0.383157
chargesum: -0.00000
title: Mulliken charges with hydrogens summed into heavy atoms:
elementType: C C C C C C C C C N B F F
charge: 0.330913 -0.912406 -0.822392 0.505859 -0.191522 -0.223448 1.567069 -0.749472 0.467539 0.399789 0.252344 -0.275918 -0.348354
1716.lowfreq: -21.3211 -0.0009 -0.0007 -0.0003 5.5877 9.2862 31.3404 110.3817 172.0097
frequency: 25.4170 110.3521 172.0019 177.4993 207.8570 282.6697 319.4424 399.7948 438.8998 452.2829 469.9261 498.1290 548.6882 554.6092 619.8551 649.7952 710.6960 783.2005 800.9240 820.3388 828.9657 846.0835 869.2288 945.5023 960.3266 965.1399 1020.3333 1024.5398 1029.8281 1042.3180 1070.1844 1097.2448 1103.1103 1134.8788 1170.4778 1195.0791 1250.9313 1252.4261 1273.1257 1338.4214 1390.3475 1435.8054 1449.9227 1496.0289 1524.4486 1610.9807 1658.0490 1659.1403 1711.1868 2400.7722 3190.5647 3200.8058 3203.0459 3215.0519 3237.6802 3250.0364 3287.8256
redmass: 9.0753 5.3261 4.3183 6.9050 4.4789 7.5499 10.3297 3.8301 4.7352 9.1284 3.2534 3.5420 6.6767 6.8459 3.8384 4.8982 3.9320 1.3511 3.3600 3.9868 5.4950 1.7565 4.5803 1.5186 2.3189 1.5708 2.1826 1.5436 1.3684 1.2992 1.8490 2.0052 1.5778 1.6719 1.3009 1.3779 2.1975 1.5383 1.6388 2.1852 2.4101 6.7156 1.8227 2.6156 2.4432 2.4467 5.1040 6.7517 4.7468 1.0796 1.0879 1.0910 1.0918 1.0984 1.0925 1.0993 1.0868
irintensity: 0.0600 3.2008 3.3388 10.2779 10.2300 25.3069 7.6626 1.4401 4.5098 8.2203 0.1113 21.2395 2.1002 9.5161 3.8093 3.6851 9.8849 17.4487 42.7008 129.3482 26.6698 95.3627 11.2966 22.9842 118.8579 13.0761 10.0808 0.4493 2.2965 29.9671 29.9145 26.0163 84.0652 351.0466 13.8986 63.9306 3.4564 5.5764 10.9994 2.3871 10.5845 119.9003 46.2062 26.7999 15.4855 76.9483 9.4911 23.4539 113.6925 377.3337 1.5263 7.2199 2.7461 17.6918 0.6454 0.4564 804.8780
temp: 298.150 k
press: 1.00000 atm
elementType: 6 6 6 6 6 6 1 6 1 1 6 6 1 1 1 7 5 9 9 1 1
symmnumber: 1
zpe: 414997.8 jmol-1
zpe.correction: 0.158064 hartree
zpe.thermalcorrener: 0.168095 hartree
zpe.thermalcorrenthalpy: 0.169039 hartree
zpe.thermalcorrgfe: 0.121482 hartree
zpe.sumelectzpe: -626.982366 hartree
zpe.sumelectthermal: -626.972335 hartree
zpe.sumelectthermalent: -626.971391 hartree
zpe.sumelectthermalfe: -627.018947 hartree
dipole: 12.4788 0.2686 -0.3041
dipole: 12.4854
quadrupole: -80.9166 -59.5553 -79.9138
quadrupole: -11.0417 3.3556 -1.1130
quadrupole: -7.4547 13.9066 -6.4519 -11.0417 3.3556 -1.1130
hfenergy: -627.1404299 hartree
pointgroup: C01 [X(C9H8B1F2N1)]
dipole: 4.9095297 0.1056859 -0.1196288 debye
dipolederiv: 0.1836105 -0.0929657 0.0053435 -0.1803944 -0.0908493 -0.0333472 0.0157166 -0.0055647 -0.1054685 -0.3185317 0.1440209 0.0269209 0.110756 -0.3662752 0.0634987 -0.0715985 -0.0032918 -0.1960302 0.4706261 -0.6697082 0.0402795 0.1124525 0.0097386 -0.0041051 0.0143044 -0.0284089 0.1437026 -0.7258897 0.5513845 -0.0631036 -0.2563196 0.1494574 -0.0137638 -0.0094208 0.0247351 0.0341613 -0.0427711 0.045307 -0.0080225 0.0855859 0.0387681 -0.0085379 -0.0011616 -0.0073088 -0.1674383 -0.0525818 0.1280274 0.0019487 0.0384916 0.2212493 -0.0077815 0.010801 -0.0006809 -0.1067469 -0.0226077 0.0780921 -0.0141871 0.0611401 0.0638543 0.004741 -0.0283612 0.0015685 0.128121 0.431125 -0.2992752 0.0318632 -0.1048113 0.7098396 -0.0492936 0.0222232 -0.0531738 -0.0237244 -0.0265198 -0.0899274 -0.0012164 -0.0380814 0.0336342 0.0059093 -0.0052885 -0.0007526 0.1595008 0.0880271 0.0188677 -0.0033587 0.0169757 -0.0999715 0.0099419 -0.0041461 0.0126482 0.1511258 -0.0035854 -0.3495997 0.0261434 -0.0266151 -0.8237014 0.0388397 0.0050745 0.0358219 -0.1840661 0.4317328 0.6802186 -0.0269212 0.0688735 0.2843013 -0.0117984 0.0076273 0.0000664 0.076915 0.0201578 -0.0432999 -0.0014994 -0.0842983 0.058378 0.0024079 0.0055036 0.0019991 0.1387191 0.0222993 0.0478949 -0.0068248 0.0500703 0.0723073 0.0078725 -0.009485 0.0094086 0.1738554 0.1005555 -0.0199381 0.000161 -0.0024848 0.0459023 0.0078609 0.0005272 0.0063957 0.1566798 -0.728564 -0.369997 0.0134636 -0.1593305 -0.1671666 0.0045365 -0.0177024 -0.0243963 -0.145234 1.7350292 0.0312023 -0.117355 0.0832969 1.3585671 -0.0419112 -0.2150569 -0.1057329 1.2398024 -1.1665246 0.1233242 0.2817101 0.1766384 -0.5296104 -0.1302468 0.4412864 -0.1289701 -0.6834112 -0.884851 -0.038859 -0.0352184 -0.0001059 -1.0647999 0.2426158 0.0035384 0.3253996 -0.5972988 -0.3757466 -0.0985128 -0.1198832 -0.1198203 -0.23992 -0.0792744 -0.1190312 -0.0555073 -0.4669019 0.8650103 0.2237435 -0.0302436 0.1679811 0.3362969 -0.0081644 -0.0453505 -0.0042552 0.2737371 unknown
polarizability: 178.0446473|-20.5553323|179.3572693|6.3668825|-5.061365|79.1955526 unknown
InChI: InChI=1/C9H8BF2N/c11-10(12)8-5-1-3-7-4-2-6-13-9(7)8/h1-6,10,13H
charge 0 multiplicity 1
21 atoms
C  -1.03690497 1.74842746 -0.13484211
C  -0.93754859 0.37396172 -0.07491425
C  0.38327891 -0.12623673 0.00962555
C  1.53761651 0.69921715 0.00171335
C  1.35726409 2.10018661 -0.07348902
C  0.08721522 2.60628838 -0.13123477
H  -2.02583854 2.19146535 -0.19066345
C  2.8039789 0.08466864 0.07455407
H  2.22645316 2.74777502 -0.07935497
H  -0.06402596 3.67870922 -0.18029711
C  2.92471 -1.28331901 0.16029507
C  1.76548364 -2.05613307 0.18756384
H  3.69129512 0.70891808 0.06434874
H  3.88911089 -1.76789111 0.21754599
H  1.77858051 -3.13428841 0.27451568
N  0.57899524 -1.48071821 0.11400188
B  -2.26692658 -0.57394946 -0.20375103
F  -3.33557324 -0.00298564 0.52848449
F  -1.96497011 -1.89879785 0.38807274
H  -2.56343819 -0.7448904 -1.37710044
H  -0.29567093 -2.02467019 0.1803775
