program: Gaussian 16
title: h_biphenylene_h2
version: ES64L-G16RevC.02
method: RwB97XD
basis: GenECP
operation: Freq
keyword: #N
keyword: Geom=AllCheck
keyword: Guess=TCheck
keyword: SCRF=Check
keyword: GenChk
keyword: RwB97XD/GenECP
keyword: Freq
converged: YES YES YES YES
title: Mulliken charges:
elementType: C C C C C C C H C H H C H C H C C H B N C H H H C H H H H H H H
charge: 0.363022 -0.047875 -0.490172 0.072535 -0.376724 -0.215331 -0.160101 0.213446 -0.550907 0.245143 0.203803 -0.512811 0.206455 -0.383958 0.221498 -0.034378 0.621978 0.236355 -0.675535 0.327031 -0.401723 0.208813 0.228559 0.243955 -0.383351 0.228330 0.202782 0.250126 -0.055855 -0.065497 -0.097960 0.378346
chargesum: -0.00000
title: Mulliken charges with hydrogens summed into heavy atoms:
elementType: C C C C C C C C C C C C B N C C
charge: 0.363022 -0.047875 -0.490172 0.072535 -0.163278 -0.215331 0.085042 -0.347104 -0.306355 -0.162460 0.201977 0.621978 -0.894846 0.705377 0.279604 0.297887
1716.lowfreq: -3.2450 0.0001 0.0002 0.0003 6.3757 10.9427 38.5446 76.5154 87.1893
frequency: 37.5177 76.4565 87.1557 144.1266 149.5135 171.2053 202.9184 212.2451 235.8092 262.4077 289.9316 295.3335 335.9970 359.4311 399.1116 461.5465 470.1083 487.4394 527.5259 554.8917 593.1633 624.6305 631.3121 662.2961 726.9160 747.4635 771.1092 778.7862 783.9612 813.0204 840.7390 892.1915 903.8935 925.8227 942.2596 962.6723 989.7792 1006.0878 1006.4799 1038.2624 1046.0969 1059.4324 1076.4883 1124.7357 1148.1632 1166.2781 1179.5596 1183.5117 1185.6753 1191.9360 1198.6255 1210.4883 1221.1916 1253.3605 1267.6287 1294.3743 1314.9649 1410.8974 1435.2890 1445.3840 1453.0100 1478.9747 1484.2649 1488.6255 1495.5949 1497.1565 1503.6217 1515.5547 1524.0209 1563.3228 1647.7365 1666.0852 1694.5730 1762.7631 2234.6010 2286.9915 2425.7655 3020.4597 3085.1334 3089.0879 3169.5216 3185.0110 3186.2287 3188.1876 3192.0840 3194.9411 3196.3530 3206.8832 3211.0725 3219.1860
redmass: 2.4431 3.0202 4.5893 2.7954 3.2505 1.3394 2.2291 1.2681 1.1671 2.3665 2.5235 3.5846 2.8964 4.2864 5.0198 4.2746 2.9445 3.3827 3.9582 3.4318 5.3980 4.7364 4.0600 4.2630 3.3260 5.8632 1.5431 3.8256 1.2217 4.3506 1.9408 1.6877 2.9159 1.3641 1.4660 3.4159 1.3116 3.6347 1.5812 1.9641 2.3776 2.1259 1.1807 1.4264 1.9570 2.2503 1.4960 1.1925 1.8440 2.1831 1.9346 1.6034 1.1218 1.8522 1.7926 2.1146 2.7561 2.3395 2.4429 1.1696 1.1854 1.1883 1.0377 1.6178 2.3526 1.0602 1.0632 1.4276 4.5911 1.2761 7.7318 7.1564 7.3586 8.9280 1.0759 1.0732 1.0896 1.0828 1.0309 1.0339 1.0867 1.1080 1.1058 1.0926 1.0916 1.1061 1.1071 1.0932 1.0954 1.0965
irintensity: 0.5102 17.6746 6.9918 20.0139 1.5688 1.1082 1.3322 4.0857 1.6764 34.4303 5.7105 1.3506 14.6719 1.8170 3.0021 0.0062 8.4379 0.0520 2.2147 4.9721 0.6978 0.6276 12.4150 2.7271 15.8110 3.5857 55.4611 20.8769 66.3175 1.7862 13.4499 0.0217 5.3080 5.9408 0.8219 43.2340 0.4915 5.8402 1.5889 15.2318 17.6258 6.9670 0.3530 70.4274 60.6695 11.4770 22.6713 10.1164 18.4580 0.8522 1.3497 0.4639 13.7226 6.4734 3.0551 7.9702 8.3662 5.0062 40.6242 0.5262 8.8759 3.2313 3.1636 5.2097 9.6168 12.9091 27.1694 28.2389 9.2052 19.3987 1.3475 0.4089 2.0351 23.5613 334.2866 273.0373 423.0648 771.9958 3.8708 16.0760 9.0602 0.5838 4.2860 39.6348 0.3446 0.5666 3.2193 7.9105 28.9962 13.2499
temp: 298.150 k
press: 1.00000 atm
elementType: 6 6 6 6 6 6 6 1 6 1 1 6 1 6 1 6 6 1 5 7 6 1 1 1 6 1 1 1 1 1 1 1
symmnumber: 1
zpe: 697915.8 jmol-1
zpe.correction: 0.265822 hartree
zpe.thermalcorrener: 0.280020 hartree
zpe.thermalcorrenthalpy: 0.280964 hartree
zpe.thermalcorrgfe: 0.225172 hartree
zpe.sumelectzpe: -622.295607 hartree
zpe.sumelectthermal: -622.281409 hartree
zpe.sumelectthermalent: -622.280465 hartree
zpe.sumelectthermalfe: -622.336257 hartree
dipole: -9.6772 4.5770 0.3743
dipole: 10.7116
quadrupole: -72.8466 -107.4251 -99.7526
quadrupole: 16.2193 -0.5018 -0.4775
quadrupole: 20.4948 -14.0837 -6.4111 16.2193 -0.5018 -0.4775
hfenergy: -622.5614294 hartree
pointgroup: C01 [X(C14H16B1N1)]
dipole: -3.8073078 1.8007349 0.1472577 debye
polarizability: 299.0257432|-22.9132813|250.4154081|-6.0510728|2.7658987|129.9301725 unknown
InChI: InChI=1/C14H16BN/c1-16(2)12-8-4-6-10-9-5-3-7-11(15)13(9)14(10)12/h3-8,16H,1-2,15H3
charge 0 multiplicity 1
32 atoms
C  1.16608568 -0.18442206 -0.04373707
C  1.77906672 1.08279641 -0.03618761
C  0.4026259 1.7378721 0.02004481
C  -0.17382647 0.44157276 0.00863161
C  -0.3816922 2.85254897 0.07546854
C  -1.50909242 0.23365248 0.04994825
C  -1.79005581 2.6313597 0.12011853
H  0.01135487 3.86179584 0.08773791
C  -2.35142332 1.37098034 0.1095344
H  -2.45009454 3.48988801 0.16490716
H  -3.4301326 1.26624066 0.14683897
C  3.14544412 1.18924274 -0.07102165
H  3.68747868 2.12728527 -0.06781849
C  3.8275196 -0.05173316 -0.113119
H  4.91260287 -0.04058564 -0.14368529
C  3.17614284 -1.28369467 -0.11594213
C  1.76121708 -1.41847227 -0.0787323
H  3.784408 -2.18335567 -0.14817268
B  0.8356188 -2.74398402 -0.05717536
N  -2.00478467 -1.15077033 0.04038615
C  -2.65591634 -1.53257985 1.32348376
H  -3.55772698 -0.93689577 1.45908244
H  -2.90109768 -2.59289326 1.28368083
H  -1.94985523 -1.34420097 2.12920189
C  -2.85577464 -1.45054865 -1.14315794
H  -3.08831505 -2.51443001 -1.13908255
H  -3.77081606 -0.86290281 -1.0887996
H  -2.29298692 -1.19496608 -2.03852916
H  0.20120337 -2.75968043 1.00676085
H  1.44222419 -3.79135771 -0.18515516
H  0.0094541 -2.650399 -0.98547481
H  -1.15467273 -1.75866929 -0.05554791
