program: Gaussian 16
title: Me_H-H2
version: ES64L-G16RevC.01
method: RwB97XD
basis: GenECP
operation: Freq
keyword: #N
keyword: Geom=AllCheck
keyword: Guess=TCheck
keyword: SCRF=Check
keyword: GenChk
keyword: RwB97XD/GenECP
keyword: Freq
converged: YES YES YES YES
title: Mulliken charges:
elementType: C C H C N N B H H H H H H H C C H H H
charge: -0.373792 0.063741 0.247077 -0.128375 0.028742 -0.172983 -0.270480 -0.126479 0.409275 0.190922 0.175634 0.240107 -0.110719 -0.130461 0.193403 -0.857114 0.210889 0.219360 0.191253
chargesum: -0.00000
title: Mulliken charges with hydrogens summed into heavy atoms:
elementType: C C C N N B C C
charge: 0.232872 0.310818 -0.128375 0.028742 0.236293 -0.638140 0.193403 -0.235613
chargesum: 0.00000
1716.lowfreq: -13.9724 -0.0007 -0.0006 -0.0001 11.8038 17.5049 79.9245 86.1665 94.7211
frequency: 79.4180 85.7768 94.2340 152.7062 210.4595 218.1788 282.8481 297.1511 443.4095 546.9434 632.3860 655.1960 663.7971 690.0913 758.8981 793.4493 854.3086 905.2247 1014.7445 1019.6871 1064.4235 1073.7843 1138.2561 1154.1523 1166.5430 1172.8386 1179.4279 1229.2907 1247.1260 1360.6628 1386.8881 1428.6480 1465.6852 1476.1061 1479.0553 1499.6494 1505.8706 1556.3029 1590.0676 1668.0420 2350.4834 2360.1987 2409.0374 3058.8805 3072.7831 3128.1687 3155.3497 3161.2977 3178.6401 3297.0552 3673.4863
redmass: 1.0388 1.0491 1.0521 2.6555 2.3472 3.0624 2.4951 3.2442 2.5342 3.7019 3.1039 4.1792 3.6926 1.1447 1.2513 3.3610 1.4137 1.7879 1.5323 4.9415 1.4713 1.7405 1.3577 1.3262 1.0520 1.0682 1.6223 2.6808 1.5888 2.9402 3.2185 1.2688 1.2471 1.0735 1.0879 1.0455 1.1036 5.9776 4.4946 4.8378 1.0449 1.1039 1.0987 1.0376 1.0342 1.1022 1.1052 1.1020 1.1053 1.0998 1.0822
irintensity: 0.0611 0.4898 0.0608 2.3714 18.8927 2.1274 1.0298 3.6902 5.5894 17.4397 0.1034 4.1796 23.8320 62.6203 56.0267 2.0052 11.4973 4.6648 10.8957 11.4950 3.8853 4.7938 21.1852 1.8448 3.4288 4.1885 99.8667 3.0145 6.4276 18.7990 12.3073 0.5045 13.6575 23.3237 31.9346 16.1779 11.6517 10.5188 97.6040 48.9164 263.2732 390.0177 346.5341 10.7817 26.6471 4.7568 7.5239 4.2958 4.2693 1.5899 114.4623
temp: 298.150 k
press: 1.00000 atm
elementType: 6 6 1 6 7 7 5 1 1 1 1 1 1 1 6 6 1 1 1
symmnumber: 1
zpe: 419214.0 jmol-1
zpe.correction: 0.159670 hartree
zpe.thermalcorrener: 0.168948 hartree
zpe.thermalcorrenthalpy: 0.169892 hartree
zpe.thermalcorrgfe: 0.125534 hartree
zpe.sumelectzpe: -331.315897 hartree
zpe.sumelectthermal: -331.306620 hartree
zpe.sumelectthermalent: -331.305676 hartree
zpe.sumelectthermalfe: -331.350033 hartree
dipole: 8.1107 9.0412 -5.3400
dipole: 13.2681
quadrupole: -68.4405 -71.2944 -53.0527
quadrupole: -26.2442 13.9127 4.4267
quadrupole: -4.1780 -7.0319 11.2098 -26.2442 13.9127 4.4267
hfenergy: -331.4755673 hartree
pointgroup: C01 [X(C5H11B1N2)]
dipole: 3.1909841 3.557097 -2.1009311 debye
dipolederiv: 0.6483253 0.1386047 0.0287003 0.0891608 0.2043977 0.0410696 -0.010743 0.0487987 0.2007094 -0.1392163 -0.2510103 0.1997076 0.1685106 -0.1281116 -0.0199855 -0.1443347 -0.0847175 -0.1567184 0.0551259 0.011651 -0.0310828 0.0113696 0.1095438 0.0672126 -0.0263319 0.0656431 0.1433931 0.3587664 0.3821477 -0.2161729 0.1102221 0.0659989 -0.0961786 -0.0068273 -0.0602173 -0.0675956 -0.8109209 -0.0924342 -0.0737122 -0.1468824 -0.0623173 -0.0585462 0.0726375 -0.0467338 -0.067226 -0.6642018 -0.1206167 0.0038414 -0.0867493 -0.2370857 -0.0171933 -0.0120157 -0.0109531 -0.1996766 0.3092978 -0.0633518 0.0288544 -0.0045842 0.4230182 0.0026374 -0.0114376 -0.0083569 0.4334258 -0.3833037 0.0523033 0.181598 0.151277 -0.3140557 -0.1243654 0.2132446 -0.0581752 -0.2454248 0.3254809 0.0245793 -0.0131713 -0.0086843 0.2720122 0.0222949 0.0081869 0.0315627 0.2819997 0.0218189 -0.0050747 -0.0066095 0.091493 -0.0198306 0.0335169 -0.03334 0.0273096 0.1029899 0.0184844 -0.025326 -0.0318953 -0.0637116 0.0723918 0.0418273 0.0549479 0.0595027 -0.0552518 -0.0341438 -0.0071208 0.0173372 -0.0802207 0.0000716 -0.0805672 -0.0332349 -0.0916486 0.0140729 -0.2387818 0.135252 -0.1186992 0.0291349 -0.3642172 0.1857176 -0.041633 0.2022555 -0.2719114 -0.2702935 -0.1484217 -0.0844664 -0.1632247 -0.2480266 -0.0693822 -0.1773495 -0.1492053 -0.4212118 0.7096463 0.0563672 0.063609 -0.0615397 0.1764564 -0.0376175 0.1372583 -0.0277417 0.190347 0.0180287 -0.0912364 0.0557774 -0.0066273 0.016688 0.0524818 -0.0135761 0.0518259 0.0448809 0.0809746 -0.0594749 -0.0374167 -0.0527537 -0.0504764 0.0240098 -0.0418765 -0.0324866 0.0052117 0.0437723 0.0154276 0.0918615 0.0338727 0.0066272 0.0048683 0.0781418 0.0511779 -0.0244743 -0.0488597 0.0477348 -0.0580607 -0.0100626 0.0769153 0.0281997 -0.011717 0.0321599 0.0924601 unknown
polarizability: 117.5888143|11.4310944|105.3430162|-0.6895636|-20.0979704|91.0066638 unknown
InChI: InChI=1/C5H11BN2/c1-4-7-5(6)3-8(4)2/h3,7H,1-2,6H3
charge 0 multiplicity 1
19 atoms
C  1.57713963 0.01574685 -0.11338618
C  -0.33337619 -1.47026466 0.62653609
H  0.31163083 -2.10514331 1.20963736
C  -1.68378563 -1.52553469 0.43886856
N  0.18426148 -0.39908916 -0.09617266
N  -1.92800145 -0.44953025 -0.40917864
B  -2.85282173 -2.49310221 0.96123943
H  -3.66472029 -1.81633935 1.5859482
H  -2.84777605 -0.21470954 -0.74956063
H  2.19844962 -0.84899746 0.11111103
H  1.84268963 0.39217487 -1.10080745
H  1.75348849 0.7914708 0.63360379
H  -2.37255192 -3.35927509 1.67451989
H  -3.40760512 -2.99076169 -0.01440043
C  -0.81469419 0.21832392 -0.72302685
C  -0.70764313 1.41194401 -1.5983642
H  -0.26601788 2.25316477 -1.05934476
H  -0.08698921 1.19971049 -2.47242361
H  -1.69674052 1.70791783 -1.94636948
