program: Gaussian 16
title: F_H-H2
version: ES64L-G16RevC.01
method: RwB97XD
basis: GenECP
operation: Freq
keyword: #N
keyword: Geom=AllCheck
keyword: Guess=TCheck
keyword: SCRF=Check
keyword: GenChk
keyword: RwB97XD/GenECP
keyword: Freq
converged: YES YES YES YES
title: Mulliken charges:
elementType: C C H C N N B H H H H H H H C F
charge: -0.365453 -0.262297 0.243712 0.004743 -0.022939 -0.255255 -0.283160 -0.120181 0.440329 0.220067 0.185175 0.228410 -0.107541 -0.121201 0.352801 -0.137211
chargesum: -0.00000
title: Mulliken charges with hydrogens summed into heavy atoms:
elementType: C C C N N B C F
charge: 0.268200 -0.018584 0.004743 -0.022939 0.185074 -0.632083 0.352801 -0.137211
1716.lowfreq: -17.1808 -10.1458 -0.0005 0.0008 0.0012 26.8682 87.6216 128.8138 162.2619
frequency: 87.5142 128.5240 161.7929 217.7969 218.7433 281.6368 327.4199 485.6132 543.4330 624.5839 655.1121 667.0495 672.1164 747.8571 820.3635 866.4248 900.3699 1005.1979 1065.7032 1120.2788 1158.2825 1168.1033 1173.9388 1179.3243 1227.0619 1252.0127 1345.7033 1375.3343 1465.7270 1491.3425 1510.4889 1585.1707 1635.3255 1703.5241 2358.9109 2372.4388 2421.0246 3083.1994 3170.7045 3188.2007 3301.7407 3672.1736
redmass: 1.0667 1.3876 1.6908 3.0111 3.0223 3.9199 5.6229 3.7555 3.9744 3.2689 1.1086 4.0289 6.7545 1.4031 4.0249 1.4380 1.7692 5.6685 1.9320 1.5035 1.3107 1.2045 1.0539 1.3240 1.4494 3.2494 4.6816 2.3248 1.2046 1.0356 1.0660 7.1870 8.4725 5.8684 1.0429 1.1053 1.1002 1.0324 1.1073 1.1061 1.1002 1.0826
irintensity: 0.0282 2.2321 1.7074 13.3085 13.3588 7.5974 0.1962 16.1562 11.3218 0.0172 103.3433 24.2641 17.3329 41.6116 46.2449 5.8003 4.0102 3.6786 2.4680 12.6667 0.5292 34.6496 3.7761 71.2515 12.9039 30.5674 32.1273 13.7730 6.4164 17.4781 7.5966 17.7481 281.5914 232.0757 231.3892 367.4464 326.2273 20.4625 4.0493 1.7667 4.1419 168.9579
temp: 298.150 k
press: 1.00000 atm
elementType: 6 6 1 6 7 7 5 1 1 1 1 1 1 1 6 9
symmnumber: 1
zpe: 325607.1 jmol-1
zpe.correction: 0.124017 hartree
zpe.thermalcorrener: 0.132284 hartree
zpe.thermalcorrenthalpy: 0.133228 hartree
zpe.thermalcorrgfe: 0.091294 hartree
zpe.sumelectzpe: -391.257926 hartree
zpe.sumelectthermal: -391.249659 hartree
zpe.sumelectthermalent: -391.248715 hartree
zpe.sumelectthermalfe: -391.290649 hartree
dipole: 8.0126 6.9165 -4.1519
dipole: 11.3701
quadrupole: -64.1932 -70.1996 -52.8442
quadrupole: -23.4704 13.6551 7.3712
quadrupole: -1.7809 -7.7873 9.5682 -23.4704 13.6551 7.3712
hfenergy: -391.3819433 hartree
pointgroup: C01 [X(C4H8B1F1N2)]
dipole: 3.1524171 2.7211774 -1.6334835 debye
dipolederiv: 0.705093 0.1284553 0.0122866 0.1218423 0.1936696 0.0579266 0.0042203 0.0598202 0.1779589 -0.172821 -0.1476268 0.1379754 0.1982775 -0.0380245 -0.0999468 -0.1711123 -0.1793428 -0.0894305 0.0672951 -0.0008321 -0.0303907 -0.0065034 0.130793 0.0583806 -0.0263532 0.0601784 0.139881 0.3900423 0.2902326 -0.1373642 0.1460669 0.1580963 -0.1962845 -0.0116095 -0.1646011 0.0321848 -0.9247512 -0.0742074 -0.135643 -0.237973 -0.1556435 0.0014417 0.0309057 0.0403811 -0.1213767 -0.7907203 -0.1744754 0.011529 -0.1163349 -0.344325 0.0921744 -0.0377398 0.0800556 -0.281112 0.2783467 -0.077587 0.038982 -0.0164043 0.3889772 0.0099922 -0.0134035 -0.0024369 0.4086522 -0.3864749 0.0767576 0.1568151 0.1618431 -0.3191484 -0.1024967 0.191475 -0.0487302 -0.2013286 0.3700716 -0.0001387 0.0097194 -0.0354732 0.2973782 0.0245152 0.040345 0.0322669 0.3144961 -0.0229424 -0.0127596 0.001644 0.0723356 -0.0140084 -0.0420339 0.0200683 -0.0335999 0.1042418 0.0302684 0.0116134 -0.0383624 -0.0475834 0.0385922 0.0669426 0.0194672 0.0808471 0.0421325 -0.0126523 -0.0217803 0.0199054 -0.0436981 0.0905056 -0.0359731 -0.0578414 -0.0619064 -0.0309853 -0.2329534 0.1144723 -0.126771 0.018341 -0.3141489 0.1796067 -0.0438993 0.2017421 -0.2959527 -0.2461072 -0.1345201 -0.0701302 -0.1710963 -0.2537369 -0.0936947 -0.1463303 -0.159698 -0.4065415 1.2091847 0.1445289 0.0862127 0.0616219 1.049509 -0.6172713 0.152693 -0.5980938 0.8818285 -0.2608792 -0.1221326 0.0635916 -0.1052619 -0.9084854 0.6967211 0.0491145 0.6931176 -0.6746486 unknown
polarizability: 107.3123239|10.9417409|84.5084461|0.5546757|-14.6832052|77.6377449 unknown
InChI: InChI=1/C4H8BFN2/c1-8-2-3(5)7-4(8)6/h2,7H,1,5H3
charge 0 multiplicity 1
16 atoms
C  1.58848553 0.0194374 -0.1204622
C  -0.34879152 -1.43637172 0.68556177
H  0.28220041 -2.01680934 1.33597265
C  -1.68765651 -1.5249416 0.45076312
N  0.19539484 -0.4026061 -0.08986151
N  -1.92607961 -0.50983289 -0.48959216
B  -2.86544642 -2.4658623 0.99592169
H  -3.70863513 -1.75250749 1.52871049
H  -2.82939562 -0.29842758 -0.88667814
H  2.21335297 -0.83345491 -0.38194874
H  1.71199871 0.80146132 -0.86673086
H  1.87172862 0.40209485 0.85943869
H  -2.39949866 -3.26222888 1.79309746
H  -3.36730287 -3.04389178 0.03799875
C  -0.79985961 0.11886866 -0.77497337
F  -0.68406384 1.11104437 -1.61131396
