program: Gaussian 16
title: h_indole_h2
version: ES64L-G16RevC.02
method: RwB97XD
basis: GenECP
operation: Freq
keyword: #N
keyword: Geom=AllCheck
keyword: Guess=TCheck
keyword: SCRF=Check
keyword: GenChk
keyword: RwB97XD/GenECP
keyword: Freq
converged: YES YES YES YES
title: Mulliken charges:
elementType: C C C C C C C C H H H N H B C H H H C H H H H H H H
charge: -0.336950 0.330525 -0.602652 -0.540261 0.684639 -0.708794 -0.405857 0.536862 0.198972 0.210594 0.226601 0.150514 0.272783 -0.299411 -0.398380 0.256653 0.184884 0.171222 -0.597092 0.166968 0.204326 0.166427 -0.100105 -0.074928 -0.117225 0.419688
chargesum: -0.00000
title: Mulliken charges with hydrogens summed into heavy atoms:
elementType: C C C C C C C C N B C C
charge: -0.336950 0.603307 -0.602652 -0.341289 0.684639 -0.498200 -0.179257 0.536862 0.570202 -0.591669 0.214379 -0.059371
1716.lowfreq: -10.6964 -0.0006 -0.0004 0.0003 9.8956 18.9421 49.4240 77.4836 129.1820
frequency: 49.4026 77.4219 129.1594 153.6054 187.2188 212.9111 234.2424 291.3304 318.1536 328.1579 364.0405 426.9399 435.9754 485.2196 560.1290 573.8781 596.1205 654.2457 744.9360 758.9001 770.3314 838.4489 842.4101 859.3856 865.3118 904.8264 915.0685 940.1772 994.7703 1006.9981 1024.1313 1058.5105 1067.2804 1139.1231 1145.6139 1156.3495 1166.0882 1167.2425 1175.0579 1186.4990 1205.7135 1257.1687 1271.7208 1292.7449 1322.9461 1366.7967 1399.5900 1419.8958 1458.3382 1470.7376 1490.8456 1491.3985 1500.4065 1503.5762 1549.3838 1648.8865 1685.7524 1702.4576 2326.1735 2364.7356 2435.2266 3046.5492 3089.0926 3114.2688 3137.9021 3187.2892 3191.2667 3196.0376 3203.0887 3212.9262 3250.1366 3485.9941
redmass: 1.0211 3.0047 3.1157 1.4887 1.9626 2.4738 1.2276 1.7679 2.7500 3.2112 3.1977 4.6278 2.8500 3.0139 4.0587 3.4987 3.0503 4.3270 4.4852 2.5620 4.1880 1.6626 2.2787 1.4364 1.7107 1.3885 1.6450 3.3662 1.3510 3.2608 1.4638 2.7273 1.5619 1.4097 2.0350 1.2208 1.3024 1.3389 1.1156 1.3845 1.3146 1.8276 1.7124 4.9593 1.5265 4.1195 1.3021 1.2572 1.3134 1.5794 1.0502 1.0506 1.1025 1.3709 3.2159 7.6714 7.4762 7.3456 1.0682 1.0800 1.0974 1.0384 1.0308 1.0990 1.1030 1.0896 1.1078 1.0930 1.1079 1.0951 1.0964 1.0748
irintensity: 0.5085 14.2337 0.5312 6.0333 10.4937 4.9763 0.8677 18.8038 4.8753 2.1540 1.1310 11.4174 8.8692 6.0712 10.4942 31.8128 8.9205 2.0676 0.1747 6.0926 4.3280 3.5883 4.5327 80.7480 15.4462 0.8486 1.2883 19.0608 1.5241 31.6061 2.0879 7.8671 16.0109 5.2129 10.7207 35.0148 52.4734 7.1264 16.7042 16.3304 2.0344 10.4974 28.2089 10.5260 7.0248 1.3451 11.6954 0.6530 6.4546 1.6776 7.3083 10.4013 38.5911 27.5092 69.6523 23.6986 83.0201 4.3376 300.3620 288.7873 319.9018 35.7551 13.2207 16.3950 16.1033 14.6463 3.3496 6.4047 0.3797 10.1982 4.4333 69.6872
temp: 298.150 k
press: 1.00000 atm
elementType: 6 6 6 6 6 6 6 6 1 1 1 7 1 5 6 1 1 1 6 1 1 1 1 1 1 1
symmnumber: 1
zpe: 574713.9 jmol-1
zpe.correction: 0.218897 hartree
zpe.thermalcorrener: 0.230417 hartree
zpe.thermalcorrenthalpy: 0.231361 hartree
zpe.thermalcorrgfe: 0.181760 hartree
zpe.sumelectzpe: -468.790603 hartree
zpe.sumelectthermal: -468.779083 hartree
zpe.sumelectthermalent: -468.778139 hartree
zpe.sumelectthermalfe: -468.827740 hartree
dipole: -9.4785 -3.4286 -0.7726
dipole: 10.1091
quadrupole: -108.8219 -62.5239 -77.1420
quadrupole: -6.0286 -4.7758 -1.9127
quadrupole: -25.9926 20.3054 5.6873 -6.0286 -4.7758 -1.9127
hfenergy: -469.0094999 hartree
pointgroup: C01 [X(C10H14B1N1)]
dipole: -3.7291148 -1.3489157 -0.3039654 debye
dipolederiv: 0.7092013 0.0376924 0.1475169 -0.1732013 0.4323717 -0.0251434 0.1178026 -0.126743 -0.2169388 -0.6203391 0.238845 -0.0694132 0.4352334 -0.0313006 -0.0206856 -0.1064192 0.0049434 -0.1588042 0.18684 -0.0014046 -0.0573731 -0.537694 0.0883204 -0.0467024 0.1160014 -0.048974 -0.0698123 -0.0925367 -0.157648 0.0394409 0.123988 0.0318513 -0.0254211 -0.0059735 -0.0285088 -0.0998222 0.2082811 0.2367235 -0.046451 0.2326417 -0.0498214 -0.0147359 -0.1243992 -0.0358882 -0.1084147 0.0241983 -0.0286595 0.0193204 -0.2651435 0.0396768 -0.0320153 0.059322 -0.0227648 -0.1328485 -0.1999673 -0.1086422 0.0157813 0.045444 0.1549593 -0.0527862 -0.0088393 -0.0489826 -0.1361628 0.7096207 0.0006924 0.0365686 0.224263 -0.226518 0.0427682 0.0166936 0.0346269 0.0626624 0.1036947 0.014511 -0.0121629 -0.0041077 -0.0595484 0.0320779 -0.0143776 0.0184226 0.1471499 -0.0864256 0.0875947 -0.02571 0.0696177 0.0598871 0.0142865 -0.0306835 0.0187613 0.1416383 0.0806361 -0.0189924 0.0002994 0.0000807 -0.0715329 0.0335928 -0.0089287 0.0353431 0.1516931 -0.5667067 -0.1350161 -0.0371194 0.0390232 -0.5359226 -0.0600433 -0.0017561 -0.0833014 -0.0485752 0.0353442 -0.0387836 0.0024732 -0.0589072 -0.007598 0.0142666 -0.0079826 0.0219904 0.1598901 0.1351117 0.054803 -0.0231508 0.1528137 0.3176956 -0.0025338 0.0400929 -0.0247132 0.3940569 0.0966163 -0.0762474 -0.0495517 -0.1124844 0.3724725 0.1136844 -0.15945 0.2622861 0.2645083 0.1022903 0.0168783 -0.0229847 0.0198711 0.032817 0.0787528 -0.0121388 0.0026039 0.0157166 0.0342122 0.0850082 0.0065965 0.0528905 0.10751 -0.0118142 -0.0058662 -0.0142267 0.0708801 0.029371 -0.122702 0.02303 -0.0473129 -0.0215218 -0.0144569 0.0579357 0.0037048 0.0590457 -0.00603 -0.0610216 0.0074082 -0.0377328 0.0888738 0.0069253 0.1502452 0.0597907 0.1139932 0.0079731 0.049481 0.0253 -0.0560026 -0.1135782 -0.0549306 -0.0262559 -0.0744937 0.0709983 -0.062166 -0.0614182 0.0383137 -0.0803826 0.07195 -0.0075892 0.0927622 0.0179825 -0.0892146 -0.0713274 0.0037591 -0.0500582 0.0685428 0.0104678 0.0751119 -0.1190867 0.0407705 0.0309612 -0.3537921 0.0799832 0.0543229 0.1024328 -0.1917597 -0.147017 0.1610486 -0.1654976 -0.3631461 -0.3117561 -0.1051032 -0.0408131 -0.2471372 -0.4109538 -0.0565349 -0.0875423 -0.0338004 -0.1150592 -0.2941536 -0.0078906 0.0043872 0.0393499 -0.2740691 0.2091169 -0.1468671 0.2273037 -0.3813625 0.2018095 0.0175578 0.0140288 0.0139138 0.1852713 -0.0481733 0.0546625 -0.0406353 0.2369673 unknown
polarizability: 233.9793081|-4.1207451|165.2414691|4.6818629|-6.1228161|104.9951877 unknown
InChI: InChI=1/C10H14BN/c1-7-3-4-8-6-10(11)12(2)9(8)5-7/h3-6,12H,1-2,11H3
charge 0 multiplicity 1
26 atoms
C  2.24255924 0.44621404 0.20222747
C  1.43276775 1.49622437 0.00074287
C  -0.04034972 -0.26701165 0.18423889
C  -1.21057837 -0.989486 0.23364042
C  -2.41219998 -0.29158112 0.06827304
C  -2.363438 1.08955159 -0.14581767
C  -1.16561679 1.79757498 -0.19224259
C  0.02646647 1.10383101 -0.02259897
H  -1.21460019 -2.06204295 0.39769409
H  -3.29628503 1.62720438 -0.28181425
H  -1.16586054 2.86797607 -0.36084413
N  1.32847779 -0.76966942 0.31130422
H  1.79330663 2.50888877 -0.10764357
B  3.80142594 0.18149899 0.40974113
C  1.67441567 -1.82750013 -0.68222519
H  1.54148924 -1.40168232 -1.67487963
H  2.71489807 -2.10313863 -0.52977063
H  1.01368728 -2.6808071 -0.53830052
C  -3.73106418 -1.01485591 0.14867297
H  -3.64314216 -2.04356514 -0.20718619
H  -4.09067161 -1.05101367 1.18171726
H  -4.49367122 -0.51216945 -0.44907247
H  4.26061314 -0.39091918 -0.57246056
H  4.36415901 1.24471213 0.59081081
H  3.91993506 -0.56090761 1.38605596
H  1.48884729 -1.14911729 1.24677658
