program: Gaussian 16
title: NH2_H-H2
version: ES64L-G16RevC.01
method: RwB97XD
basis: GenECP
operation: Freq
keyword: #N
keyword: Geom=AllCheck
keyword: Guess=TCheck
keyword: SCRF=Check
keyword: GenChk
keyword: RwB97XD/GenECP
keyword: Freq
converged: YES YES NO YES
title: Mulliken charges:
elementType: C C H C N N B H H H H H H H C N H H
charge: -0.430891 -0.020558 0.236811 -0.173263 -0.020069 -0.253494 -0.276021 -0.131707 0.413247 0.188718 0.201734 0.229329 -0.114936 -0.134455 0.099819 -0.420208 0.304496 0.301448
chargesum: -0.00000
title: Mulliken charges with hydrogens summed into heavy atoms:
elementType: C C C N N B C N
charge: 0.188889 0.216253 -0.173263 -0.020069 0.159753 -0.657119 0.099819 0.185737
1716.lowfreq: -0.0006 -0.0003 0.0003 15.6513 21.7631 33.2037 97.2226 111.6659 151.3165
frequency: 96.7035 111.5084 151.2667 193.5456 214.9736 258.3325 297.1123 309.6437 470.9585 543.1808 547.9923 604.0527 623.2222 675.9048 705.3026 740.9016 829.0994 855.2351 902.6090 1011.2406 1064.6949 1106.7863 1127.0053 1154.1241 1165.9198 1174.5760 1176.5566 1239.2230 1275.5347 1356.1269 1381.1858 1465.3112 1495.6560 1511.3740 1612.1398 1616.3433 1661.3353 1710.1860 2344.8902 2352.3044 2408.9174 3059.4475 3135.0812 3177.1300 3300.5552 3615.3460 3685.6157 3715.4906
redmass: 1.0737 1.0543 2.4572 2.0249 2.3643 1.8063 1.9833 3.8519 2.6214 1.5221 2.6573 1.5542 1.8380 4.3672 2.2450 1.8732 3.3466 1.4473 1.7383 5.3624 1.8490 1.4086 1.4528 1.3099 1.0807 1.1052 1.4697 1.5717 2.6549 5.9209 1.9895 1.2033 1.0386 1.0626 3.5164 6.3106 1.5179 3.5823 1.0460 1.1039 1.0972 1.0353 1.1062 1.1027 1.0998 1.0487 1.0816 1.1002
irintensity: 0.7113 0.4512 0.8324 13.5778 19.4518 17.6993 17.1933 3.8793 3.5047 239.0457 90.0702 73.0008 48.1218 2.9593 68.1398 21.0679 14.4419 9.4981 6.4902 9.5287 15.4440 5.2447 13.2544 1.9463 9.5527 13.3869 87.3829 0.7443 5.7229 27.2173 16.3365 4.2342 17.4080 6.5107 91.4382 61.9201 12.6965 441.2547 280.6257 403.2560 346.8848 32.8247 11.1886 2.6229 1.9321 83.7291 124.1580 60.8573
temp: 298.150 k
press: 1.00000 atm
elementType: 6 6 1 6 7 7 5 1 1 1 1 1 1 1 6 7 1 1
symmnumber: 1
zpe: 390171.9 jmol-1
zpe.correction: 0.148609 hartree
zpe.thermalcorrener: 0.157664 hartree
zpe.thermalcorrenthalpy: 0.158608 hartree
zpe.thermalcorrgfe: 0.115382 hartree
zpe.sumelectzpe: -347.368160 hartree
zpe.sumelectthermal: -347.359105 hartree
zpe.sumelectthermalent: -347.358161 hartree
zpe.sumelectthermalfe: -347.401387 hartree
dipole: 7.8475 10.4356 -5.0667
dipole: 14.0056
quadrupole: -66.6641 -68.2637 -55.2864
quadrupole: -27.8042 15.0581 3.0414
quadrupole: -3.2594 -4.8590 8.1183 -27.8042 15.0581 3.0414
hfenergy: -347.516769 hartree
pointgroup: C01 [X(C4H10B1N3)]
dipole: 3.0874387 4.1056972 -1.9934015 debye
dipolederiv: 0.6822924 0.1446897 0.0180231 0.1342912 0.2090544 0.05871 -0.0162066 0.0779516 0.2081493 -0.1379033 -0.1074666 0.114983 0.2785842 -0.0236089 -0.1106623 -0.1836235 -0.1720025 -0.1463362 0.0509257 0.0089904 -0.0363151 0.0002084 0.1043166 0.0750456 -0.0363853 0.0691533 0.1469366 0.3322169 0.245218 -0.1088931 0.0468045 0.1337697 -0.1734591 0.044627 -0.1551391 -0.0123931 -0.8968882 0.0514881 -0.2196606 -0.2713711 -0.2687232 0.0720465 0.097533 0.1500557 -0.2306637 -0.7282897 -0.3434144 0.1806481 -0.0585101 -0.4680102 0.1522162 -0.0490181 0.0690648 -0.3006296 0.3351603 -0.0513872 0.0182628 0.0010922 0.4257556 0.0110006 -0.0139565 0.0026721 0.4411489 -0.3967169 0.0545708 0.181064 0.1538165 -0.3168535 -0.1282846 0.2177001 -0.0642642 -0.2476317 0.327941 0.0318557 -0.0207714 -0.014526 0.2613144 0.0384861 0.0123681 0.0520009 0.2821685 0.0399847 -0.0061289 -0.0081892 0.0813481 0.0025854 0.0528291 -0.0483571 0.0455672 0.0926852 -0.0047225 -0.0322819 -0.0237592 -0.0689663 0.0797115 0.0181486 0.078229 0.027656 -0.06448 -0.0373751 0.0031466 0.0135821 -0.0971926 -0.047935 -0.0831803 -0.015341 -0.0867756 0.035253 -0.2366166 0.1338425 -0.1155282 0.0273349 -0.3718087 0.1869013 -0.0398415 0.2038525 -0.2704116 -0.2786391 -0.1446299 -0.089089 -0.1617319 -0.2426177 -0.0706946 -0.1842886 -0.1480408 -0.4314457 0.8780987 0.1337719 -0.0109629 0.021181 1.1678604 -0.6731765 0.0598086 -0.6966684 0.8890378 -0.3544976 -0.14903 0.2110426 -0.0245506 -1.0479877 0.4743873 0.1341056 0.7724146 -1.0997627 0.1758669 -0.0470067 0.0202947 -0.034263 0.2117624 0.0438582 0.0396874 -0.0595172 0.3907478 0.2491624 0.0737718 -0.1247317 -0.0135492 0.1914144 0.055828 -0.0970407 -0.0879809 0.3176273 unknown
polarizability: 114.8311497|11.0977543|101.817587|-0.2608431|-19.8748729|87.5464618 unknown
InChI: InChI=1/C4H10BN3/c1-8-2-3(5)7-4(8)6/h2,7H,6H2,1,5H3
charge 0 multiplicity 1
18 atoms
C  1.58210543 0.0105662 -0.13870966
C  -0.33763773 -1.4810031 0.64627161
H  0.3084607 -2.1068764 1.23700062
C  -1.67688125 -1.54419195 0.44410336
N  0.18999006 -0.39076176 -0.07104852
N  -1.93282817 -0.45419287 -0.40603718
B  -2.85530171 -2.50975556 0.94760979
H  -3.66797548 -1.83502857 1.57554711
H  -2.85294917 -0.22508471 -0.74682585
H  2.19045518 -0.79879717 0.25900383
H  1.87203587 0.18607914 -1.17642305
H  1.76043835 0.9103175 0.4549911
H  -2.38653866 -3.38776291 1.65437205
H  -3.40902214 -2.9922726 -0.03707873
C  -0.81542778 0.21525593 -0.69583938
N  -0.69265445 1.27828865 -1.54326294
H  -1.55495878 1.72887668 -1.80710885
H  0.04253659 1.93560817 -1.33092272
