program: Gaussian 16
title: OH_H-H2
version: ES64L-G16RevC.01
method: RwB97XD
basis: GenECP
operation: Freq
keyword: #N
keyword: Geom=AllCheck
keyword: Guess=TCheck
keyword: SCRF=Check
keyword: GenChk
keyword: RwB97XD/GenECP
keyword: Freq
converged: YES YES YES YES
title: Mulliken charges:
elementType: C C H C N N B H H H H H H H C O H
charge: -0.378659 -0.138576 0.240323 -0.100031 -0.042543 -0.240156 -0.279750 -0.127137 0.424623 0.207456 0.191763 0.227526 -0.111079 -0.130795 0.196030 -0.273289 0.334293
chargesum: 0.00000
title: Mulliken charges with hydrogens summed into heavy atoms:
elementType: C C C N N B C O
charge: 0.248086 0.101747 -0.100031 -0.042543 0.184467 -0.648760 0.196030 0.061005
chargesum: -0.00000
1716.lowfreq: -14.1528 -0.0007 -0.0004 -0.0003 14.9177 22.2964 69.0863 87.6694 145.0851
frequency: 68.2811 87.5474 144.4745 168.2518 213.7202 229.1592 300.5018 327.5699 505.1169 547.1026 597.1928 622.7834 683.4192 697.0641 749.5209 836.0873 862.5302 901.3923 1008.3092 1071.7786 1124.6062 1156.6420 1163.4425 1165.9724 1172.6453 1188.9610 1246.4243 1286.8189 1350.3316 1417.0663 1466.4214 1493.2938 1513.3636 1614.5817 1622.6961 1725.9064 2348.5432 2357.5657 2414.8299 3077.4541 3159.9967 3185.6211 3302.4588 3679.1019 3904.0684
redmass: 1.0563 1.0519 1.9875 1.8033 2.4494 2.1727 3.2211 4.6492 3.3345 3.7715 1.2284 2.6996 6.2764 2.9835 1.5504 2.8069 1.7341 1.7505 5.5322 1.8462 1.5363 1.3068 1.2072 1.2426 1.0829 1.4353 1.9596 2.0816 5.9456 1.7069 1.1923 1.0365 1.0656 7.0795 7.2403 4.8077 1.0457 1.1036 1.0979 1.0332 1.1066 1.1052 1.0998 1.0818 1.0667
irintensity: 2.8601 0.0660 22.5018 118.4786 21.6645 12.4971 14.1446 2.5480 2.3200 13.8580 103.5318 12.1329 26.1128 24.3803 42.8673 31.4411 4.5342 5.8548 7.3120 2.6091 12.0006 13.6159 86.1877 129.7421 10.7914 67.2007 33.6558 5.1878 27.6626 10.6354 3.4215 16.7866 12.1838 29.3552 323.4170 232.6975 264.2654 391.3350 333.3081 29.3960 7.5945 2.1331 2.8905 137.9317 222.4825
temp: 298.150 k
press: 1.00000 atm
elementType: 6 6 1 6 7 7 5 1 1 1 1 1 1 1 6 8 1
symmnumber: 1
zpe: 357447.9 jmol-1
zpe.correction: 0.136145 hartree
zpe.thermalcorrener: 0.145140 hartree
zpe.thermalcorrenthalpy: 0.146084 hartree
zpe.thermalcorrgfe: 0.102410 hartree
zpe.sumelectzpe: -367.240428 hartree
zpe.sumelectthermal: -367.231432 hartree
zpe.sumelectthermalent: -367.230488 hartree
zpe.sumelectthermalfe: -367.274162 hartree
dipole: 6.4294 8.6884 -5.3360
dipole: 12.0540
quadrupole: -63.6989 -70.3763 -51.5445
quadrupole: -28.5776 17.1672 4.1226
quadrupole: -1.8257 -8.5031 10.3287 -28.5776 17.1672 4.1226
hfenergy: -367.3765723 hartree
pointgroup: C01 [X(C4H9B1N2O1)]
dipole: 2.5295131 3.4182938 -2.0993562 debye
dipolederiv: 0.7187756 0.1049569 0.0386899 0.1051898 0.178548 0.070778 0.0059423 0.0758509 0.1890872 -0.1642621 -0.1242143 0.1035378 0.2382205 -0.0040847 -0.1181168 -0.1777029 -0.1785035 -0.1187872 0.0589857 0.0087837 -0.0311151 0.0026568 0.1129119 0.0666811 -0.0257021 0.0674807 0.1475039 0.350438 0.2410346 -0.0987088 0.0859804 0.1600947 -0.1885606 0.0143359 -0.1661421 0.0025471 -0.9172307 0.0397682 -0.1868343 -0.2524352 -0.2350204 0.0453016 0.0759746 0.0950766 -0.1788383 -0.7671124 -0.2689091 0.0991465 -0.0877222 -0.452714 0.1350877 -0.0259722 0.105716 -0.3165073 0.310043 -0.0610102 0.0258 -0.0048409 0.4092421 0.0148156 -0.0117548 0.0060229 0.4269787 -0.3877677 0.0605064 0.1731777 0.1512939 -0.3161119 -0.1245118 0.2127704 -0.0651526 -0.2383209 0.3451669 0.0219144 -0.0125151 -0.017642 0.2685094 0.0430328 0.0142911 0.0504733 0.2961133 -0.0279495 -0.0005299 -0.0000308 0.0922538 -0.0229017 -0.0450759 0.0193256 -0.0388642 0.0995977 0.0363659 0.0045063 -0.0327585 -0.0552071 0.03846 0.0647254 0.0245356 0.0764229 0.0393596 -0.0293963 -0.0193675 0.0086566 -0.047444 0.0834505 -0.0460345 -0.0747438 -0.0696 -0.0485329 -0.2343184 0.1304749 -0.1145799 0.0259186 -0.3597289 0.1816704 -0.0393537 0.1984098 -0.2656855 -0.2720684 -0.1392127 -0.0901742 -0.1619118 -0.237055 -0.0733125 -0.1784289 -0.1444681 -0.4297161 1.0406576 0.0992939 0.0572032 -0.014427 1.273507 -0.6982874 0.1357403 -0.6712672 0.8565875 -0.3264725 0.0022778 0.0116132 0.0163235 -1.3526916 0.7310118 0.0029312 0.7136135 -0.9075561 0.2661452 -0.1002734 0.0488917 -0.0762071 0.4555847 -0.059205 0.0278116 -0.0550688 0.4461694 unknown
polarizability: 111.5769818|9.3179953|92.8209935|1.2205168|-16.762564|80.6200861 unknown
InChI: InChI=1/C4H9BN2O/c1-7-2-3(5)6-4(7)8/h2,6,8H,1,5H3
charge 0 multiplicity 1
17 atoms
C  1.58389321 0.04028744 -0.09035159
C  -0.33892047 -1.45779768 0.65848553
H  0.3071052 -2.08999939 1.24255302
C  -1.68079686 -1.51743716 0.46229018
N  0.19020942 -0.3705336 -0.05729975
N  -1.93699953 -0.42850049 -0.39207858
B  -2.86149517 -2.47857069 0.96609199
H  -3.67397637 -1.79784809 1.58619219
H  -2.85860712 -0.19951681 -0.73107388
H  2.202699 -0.81862398 -0.34803967
H  1.71284237 0.81594284 -0.84230918
H  1.87846974 0.42696816 0.88563803
H  -2.39427497 -3.35174208 1.67834094
H  -3.41037419 -2.96439142 -0.0190481
C  -0.81351328 0.2267373 -0.67659254
O  -0.64401848 1.29880666 -1.43492149
H  -1.47156936 1.59295622 -1.82462683
