program: Gaussian 16
title: NO2_H-H2
version: ES64L-G16RevC.01
method: RwB97XD
basis: GenECP
operation: Freq
keyword: #N
keyword: Geom=AllCheck
keyword: Guess=TCheck
keyword: SCRF=Check
keyword: GenChk
keyword: RwB97XD/GenECP
keyword: Freq
converged: YES YES YES YES
title: Mulliken charges:
elementType: C C H C N N B H H H H H H H C N O O
charge: -0.409935 0.157297 0.298036 -0.142830 0.022378 -0.170878 -0.303102 -0.132880 0.430789 0.180302 0.247412 0.247085 -0.097670 -0.069528 0.035632 -0.263638 -0.006942 -0.021528
chargesum: -0.00000
title: Mulliken charges with hydrogens summed into heavy atoms:
elementType: C C C N N B C N O O
charge: 0.264864 0.455333 -0.142830 0.022378 0.259911 -0.603181 0.035632 -0.263638 -0.006942 -0.021528
1716.lowfreq: -13.0697 -0.0008 -0.0005 0.0006 11.7481 24.2116 74.4538 79.9989 134.8261
frequency: 74.0810 79.6712 134.7857 178.0777 181.4409 200.6062 260.0635 292.7118 375.4700 430.3433 551.2649 586.6171 616.7278 630.3538 719.9676 747.8334 757.3375 798.3961 860.5127 880.0889 891.7015 1016.7489 1076.5951 1143.1951 1154.1114 1160.6659 1161.6742 1183.5410 1206.1774 1251.9661 1347.5974 1396.2182 1425.0773 1440.1116 1474.4538 1486.6215 1511.8071 1592.4024 1630.8345 1649.5729 2376.1451 2400.0149 2433.5338 3098.3859 3194.5515 3202.7055 3297.8587 3638.8663
redmass: 1.0332 7.2363 3.8548 3.4786 1.7769 1.5272 3.3968 3.8930 3.8876 7.5715 4.1122 4.6048 3.8838 3.6384 8.2079 3.5938 1.2390 1.3392 1.4824 7.3227 1.9537 4.9066 1.9179 1.2174 1.3301 1.1883 1.0767 1.3188 4.0014 1.6515 3.3322 5.1921 4.2575 5.2263 1.2366 1.0360 1.1885 8.2476 4.7514 10.1226 1.0406 1.1036 1.1052 1.0314 1.1073 1.1080 1.1003 1.0826
irintensity: 2.9043 4.7480 16.1846 28.1756 3.0190 0.1590 0.0059 2.9768 3.6013 3.9855 30.8701 3.6078 1.5973 5.8996 0.0770 47.7333 114.5510 9.0922 8.8252 44.9993 25.9763 13.5770 248.4500 30.5959 0.2646 7.8470 9.8070 157.9160 1.2260 192.4963 342.4603 283.4435 14.9569 707.9789 14.7967 18.7860 10.5061 253.8675 73.4563 221.2420 168.6384 297.0361 303.4852 5.5163 0.7322 1.8615 6.3069 180.9987
temp: 298.150 k
press: 1.00000 atm
elementType: 6 6 1 6 7 7 5 1 1 1 1 1 1 1 6 7 8 8
symmnumber: 1
zpe: 354091.6 jmol-1
zpe.correction: 0.134866 hartree
zpe.thermalcorrener: 0.144634 hartree
zpe.thermalcorrenthalpy: 0.145578 hartree
zpe.thermalcorrgfe: 0.099598 hartree
zpe.sumelectzpe: -496.496270 hartree
zpe.sumelectthermal: -496.486503 hartree
zpe.sumelectthermalent: -496.485558 hartree
zpe.sumelectthermalfe: -496.531538 hartree
dipole: 7.7752 3.2762 -1.2420
dipole: 8.5282
quadrupole: -74.7059 -83.9738 -67.4630
quadrupole: -20.5944 9.1773 11.7712
quadrupole: 0.6750 -8.5929 7.9179 -20.5944 9.1773 11.7712
hfenergy: -496.6311367 hartree
pointgroup: C01 [X(C4H8B1N3O2)]
dipole: 3.0589996 1.2889603 -0.4886437 debye
dipolederiv: 0.5807054 0.0632033 0.007807 0.0215625 0.2007924 -0.0082427 0.0304791 -0.0043774 0.1844998 -0.14113 -1.0611409 0.6999215 0.0450417 -0.5214292 0.3020135 -0.0544626 0.1831616 -0.2230627 0.0758367 0.0039304 -0.0158713 0.0030099 0.1498239 0.0211672 -0.0142171 0.025877 0.1610232 0.5373363 1.2898842 -0.7500649 0.2949857 0.0943581 0.0046025 -0.046958 0.1893756 -0.1733476 -0.6703529 -0.3128725 0.14975 -0.0976846 0.6694534 -0.5335783 -0.0095838 -0.5627463 0.3216795 -0.5853928 0.2565211 -0.2124419 -0.0289415 0.2111424 -0.2606654 -0.0387228 -0.2771051 0.035356 0.2366274 -0.196645 0.0706239 -0.1650428 0.1451219 0.0611325 -0.0881429 -0.1566135 0.4192279 -0.4192026 0.0591285 0.1119045 0.2037738 -0.2630897 -0.022361 0.1053849 0.0847403 -0.1684738 0.4028326 -0.0158599 0.0177846 -0.0154889 0.2996763 0.0030609 0.0209959 0.001272 0.3082992 0.0538771 -0.0203316 0.0071716 0.0651631 0.0262608 0.0748235 -0.0527161 0.0630649 0.0684054 0.0151555 -0.000747 -0.0401989 -0.0327548 0.0976226 -0.0069492 0.0240855 -0.0081841 -0.01138 0.0050709 0.0462406 0.0083163 -0.0281444 0.0017051 -0.047469 0.0150908 -0.0331673 0.0859689 -0.2230001 0.0352428 -0.1164831 0.0087664 -0.1947194 0.139086 -0.0225209 0.23073 -0.4006771 -0.1774462 -0.1426845 0.0474521 -0.1303981 -0.3265692 -0.1221723 -0.0216572 -0.1783992 -0.3253584 0.5815072 0.0102326 0.0136219 -0.200075 -1.2995708 1.0089785 0.199522 1.0840305 -0.4961324 2.0282287 0.0455248 0.1742751 0.2046819 2.4318171 -1.4208056 0.0672306 -1.4766459 1.3092209 -1.2200963 -0.6241088 0.3039738 -0.4056809 -0.9062752 0.3987394 0.1625711 0.3823907 -0.4919482 -1.0805569 0.5644819 -0.4775424 0.2572261 -0.8161206 0.4086396 -0.2763786 0.4525962 -0.6033007 unknown
polarizability: 127.6575938|16.0772795|139.1500151|-2.5890182|-44.8705249|99.1365839 unknown
InChI: InChI=1/C4H8BN3O2/c1-7-2-3(5)6-4(7)8(9)10/h2,6H,1,5H3
charge 0 multiplicity 1
18 atoms
C  1.63104078 -0.09323197 -0.15606669
C  -0.32422842 -1.48108025 0.57978099
H  0.30978849 -2.15179432 1.13468729
C  -1.70409857 -1.50814868 0.42353785
N  0.20463877 -0.42390508 -0.1027642
N  -1.94823066 -0.42059272 -0.3693682
B  -2.83535299 -2.51196559 0.94027124
H  -3.85266687 -1.8676222 1.14854797
H  -2.86546824 -0.12685695 -0.68038154
H  2.15522518 -0.84174674 0.43278376
H  1.97580717 -0.11614082 -1.18723688
H  1.79538387 0.89730667 0.26155305
H  -2.43435597 -3.07532891 1.94245766
H  -3.03176468 -3.32237082 0.04434908
C  -0.81498218 0.21726317 -0.68197463
N  -0.76541246 1.39035157 -1.48188639
O  0.32537866 1.88845386 -1.69511523
O  -1.83452083 1.80325237 -1.89328979
