program: Gaussian 16
title: MeQHBH2-H2
version: ES64L-G16RevC.01
method: RwB97XD
basis: GenECP
operation: Freq
keyword: #N
keyword: Geom=AllCheck
keyword: Guess=TCheck
keyword: SCRF=Check
keyword: GenChk
keyword: RwB97XD/GenECP
keyword: Freq
converged: YES YES YES YES
title: Mulliken charges:
elementType: C C H C N N N B H H H H H H H
charge: -0.404453 -0.321552 0.270174 0.031789 0.249480 -0.117887 -0.176533 -0.273151 -0.094906 0.439395 0.209258 0.210321 0.225503 -0.103990 -0.143448
chargesum: -0.00000
title: Mulliken charges with hydrogens summed into heavy atoms:
elementType: C C C N N N B
charge: 0.240629 -0.051379 0.031789 0.249480 -0.117887 0.262862 -0.615495
1716.lowfreq: -13.4907 -7.2351 -0.0003 0.0002 0.0003 11.0144 62.1238 63.0371 163.0827
frequency: 60.1078 62.9336 163.0820 227.5772 309.1919 399.2519 557.5732 637.9335 690.1974 745.5657 772.4567 815.8794 861.9997 899.1681 1052.3385 1081.2565 1093.7344 1149.6029 1159.1597 1163.2928 1166.2919 1188.6198 1242.9663 1313.3376 1406.6496 1453.6071 1456.8879 1486.8830 1489.6837 1521.6078 1603.7413 2373.5417 2408.4667 2415.5850 3088.7214 3178.8937 3202.2968 3303.7855 3655.6296
redmass: 1.1253 1.0322 2.5139 2.4443 3.5047 2.7093 3.7725 2.7372 8.2164 4.2308 1.1090 1.2558 1.3988 1.8918 4.5732 1.9539 2.6372 1.2625 1.3366 1.3097 1.0512 1.3405 2.1463 4.7570 3.5866 2.0444 1.5270 1.1311 2.1233 1.4965 3.5350 1.0436 1.0988 1.1069 1.0323 1.1071 1.1066 1.1016 1.0838
irintensity: 0.1213 0.1237 3.5094 13.8391 11.2704 12.8500 23.4049 2.1208 2.5969 1.8177 121.2241 15.6350 15.7887 0.2464 24.5754 3.9572 58.7873 30.3615 1.6582 5.3903 3.2029 66.7575 78.5734 8.6821 40.1812 16.4297 6.9021 21.6199 26.0664 5.7786 53.3432 199.4124 304.8236 308.7119 12.0538 2.2993 0.1295 5.5186 150.6789
temp: 298.150 k
press: 1.00000 atm
elementType: 6 6 1 6 7 7 7 5 1 1 1 1 1 1 1
symmnumber: 1
zpe: 316170.0 jmol-1
zpe.correction: 0.120423 hartree
zpe.thermalcorrener: 0.127791 hartree
zpe.thermalcorrenthalpy: 0.128735 hartree
zpe.thermalcorrgfe: 0.088337 hartree
zpe.sumelectzpe: -308.039642 hartree
zpe.sumelectthermal: -308.032273 hartree
zpe.sumelectthermalent: -308.031329 hartree
zpe.sumelectthermalfe: -308.071727 hartree
dipole: 8.1150 5.0667 -2.4770
dipole: 9.8823
quadrupole: -58.6167 -61.6813 -47.8028
quadrupole: -21.3561 12.3995 6.2049
quadrupole: -2.5831 -5.6477 8.2308 -21.3561 12.3995 6.2049
hfenergy: -308.1600645 hartree
pointgroup: C01 [X(C3H8B1N3)]
dipole: 3.192701 1.9933974 -0.9745133 debye
dipolederiv: 0.569124 0.1360492 -0.0142378 0.1112933 0.1978464 0.0329112 -0.0279179 0.0289073 0.1616306 -0.1871556 -0.4128624 0.3425389 0.0190512 -0.1764396 0.079794 -0.0411263 -0.0248915 -0.0767764 0.0914726 0.000804 -0.0271368 0.0012346 0.1528754 0.0417268 -0.0274692 0.0426237 0.1570546 0.3837655 0.5462853 -0.3974428 0.2233086 0.1497471 -0.0929376 -0.1198608 -0.0217442 -0.0199902 -0.4524773 -0.113547 -0.003822 0.0068139 0.2712641 -0.2720508 -0.0712307 -0.2937383 0.1875535 0.1573028 -0.1305178 0.1776226 -0.1732206 -0.5839018 0.4113308 0.1980447 0.4130669 -0.3766717 -0.4572563 0.1020725 -0.1759022 -0.0827075 0.1014035 -0.2276723 -0.0039252 -0.1748733 0.0238113 0.3716898 -0.0733852 0.0821508 -0.0927899 0.2794531 0.0446403 0.1182348 0.0664273 0.3133687 -0.2066633 -0.0799583 0.0461612 -0.0309284 -0.1253567 -0.0845274 0.1061969 -0.026311 -0.4886087 0.3451731 -0.0277017 0.0342039 -0.0429138 0.2988061 0.0000938 0.0461314 0.0064963 0.3175361 -0.0055209 -0.0223776 0.009836 0.058578 -0.0171626 -0.0297216 0.0204136 -0.0201166 0.1130733 0.047985 0.0188911 -0.0470898 -0.0400474 0.0667699 0.0503256 0.0189436 0.0688056 0.05159 -0.001476 -0.0290094 0.0323982 -0.0511931 0.0849626 -0.0355864 -0.0332342 -0.060492 -0.0171714 -0.2216811 0.0712126 0.0534896 -0.0076646 -0.501091 -0.030381 0.0163626 -0.0848243 -0.0979242 -0.4342822 0.0140449 -0.1127696 0.1011858 -0.1991765 0.1120547 -0.1995634 0.0806639 -0.2484754 unknown
polarizability: 99.1381878|12.0894639|83.2354267|-1.4844002|-16.2914855|75.1557458 unknown
InChI: InChI=1/C3H8BN3/c1-7-2-3(4)5-6-7/h2,5H,1,4H3
charge 0 multiplicity 1
15 atoms
C  1.57892655 0.02882154 -0.04225186
C  -0.31301939 -1.43882436 0.75763749
H  0.3046233 -2.02973216 1.41174031
C  -1.67085026 -1.50105362 0.49176408
N  0.19841335 -0.4333278 0.00740344
N  -0.70793161 0.15877261 -0.71933593
N  -1.80779414 -0.49580795 -0.41197978
B  -2.8893551 -2.41040617 1.00238288
H  -3.03902642 -2.21298695 2.19802454
H  -2.67358256 -0.22485385 -0.85771858
H  2.22949118 -0.81812046 -0.25377333
H  1.65550235 0.76772441 -0.83568401
H  1.84336228 0.47657777 0.91477417
H  -2.61398845 -3.58206863 0.80159186
H  -3.8884668 -2.07807977 0.37795837
