program: Gaussian 16
title: h_naphthalene_h2
version: ES64L-G16RevC.02
method: RwB97XD
basis: GenECP
operation: Freq
keyword: #N
keyword: Geom=AllCheck
keyword: Guess=TCheck
keyword: SCRF=Check
keyword: GenChk
keyword: RwB97XD/GenECP
keyword: Freq
converged: YES YES NO YES
title: Mulliken charges:
elementType: C C C C C C H C C H H C C H H H B N C H H H C H H H H H H H
charge: -0.250399 -0.082583 0.451950 0.020712 -0.189744 -0.444091 0.192607 0.013927 -0.130633 0.190234 0.237787 -0.495785 -0.494998 0.188975 0.225374 0.214051 -0.611525 0.171556 -0.387272 0.189469 0.224651 0.245664 -0.389633 0.221766 0.192908 0.236528 -0.041196 -0.020366 -0.073360 0.393424
chargesum: -0.00000
title: Mulliken charges with hydrogens summed into heavy atoms:
elementType: C C C C C C C C C C B N C C
charge: -0.057792 -0.082583 0.451950 0.020712 0.000491 -0.206304 0.013927 0.058341 -0.270411 -0.280947 -0.746446 0.564981 0.272512 0.261568
1716.lowfreq: -26.1963 -8.0756 -0.0004 -0.0003 0.0002 4.7570 36.5864 65.5228 139.1338
frequency: 36.3982 64.0898 139.0963 177.7548 190.0028 200.6442 217.6205 225.3423 298.9077 324.1922 353.0751 389.2080 428.2813 467.5968 478.5068 498.5800 506.0045 540.3954 556.0154 600.7705 665.6929 674.0288 764.6080 785.8442 797.0908 800.4415 829.4538 876.8334 890.2679 921.7601 930.3723 957.3380 991.3860 1005.7643 1016.4341 1040.2432 1043.9916 1066.2052 1105.9342 1117.2582 1159.0835 1177.5064 1185.2321 1197.5658 1205.1028 1224.7467 1231.0306 1251.8514 1256.3174 1270.9365 1292.3327 1358.5707 1391.2948 1405.8539 1415.8916 1449.0057 1465.9295 1470.5723 1481.9213 1488.6321 1492.9312 1503.9169 1506.9853 1543.7940 1579.3592 1644.3500 1661.9123 1702.4418 2262.6736 2323.8698 2447.3632 2898.1602 3081.0958 3086.2623 3177.3947 3178.0088 3181.1767 3187.2856 3189.3069 3190.9363 3194.4635 3198.1025 3203.0866 3217.6958
redmass: 3.0884 2.7659 3.3651 1.3508 1.9115 1.9723 2.6399 1.5491 2.7959 1.2836 2.7833 2.3323 3.0695 3.6950 3.1636 3.3874 4.9054 4.0902 5.8655 3.0594 3.4012 3.3358 1.4261 4.3995 1.6879 4.5498 1.6730 1.8516 1.9376 2.3681 1.4421 1.4516 3.3937 1.3306 1.3350 3.4453 2.1335 1.1653 2.2530 1.8683 1.2831 1.4160 1.3926 1.8346 1.3073 1.1158 1.8582 1.7234 1.3649 1.3996 2.1349 2.9459 2.6205 4.4131 1.2542 1.1558 1.6810 1.1958 1.0499 1.0563 2.4811 1.0568 1.1694 2.0858 1.8462 6.8133 5.3905 5.2999 1.0716 1.0768 1.0930 1.0841 1.0313 1.0328 1.0860 1.1078 1.1067 1.0889 1.0908 1.1054 1.1059 1.0943 1.0982 1.0978
irintensity: 6.2256 16.0555 3.2904 1.2118 0.8326 9.1067 0.2410 7.2447 3.3138 1.0380 9.7541 42.0492 2.5734 14.4926 1.9183 4.6972 1.0926 7.8875 2.9964 2.0663 5.1636 1.5055 4.3983 7.8938 54.2764 3.9447 71.2165 15.7098 0.3553 4.3281 0.7948 0.2571 18.9458 0.3706 0.7878 13.2186 16.3890 0.7099 1.5547 5.4742 84.4812 22.1267 3.2274 5.3184 9.2741 3.6798 2.2959 3.2581 6.7113 14.4952 0.5701 17.3471 15.3984 35.2689 11.1839 6.7171 4.0305 3.5700 7.3083 8.1118 3.2877 21.0983 19.6338 39.3035 18.7171 16.9334 0.6791 7.0569 312.8980 273.5842 363.1342 1165.8791 5.2678 11.9936 1.9750 0.3468 9.8855 1.1500 21.1245 1.5188 1.0153 15.7892 42.8269 14.0060
temp: 298.150 k
press: 1.00000 atm
elementType: 6 6 6 6 6 6 1 6 6 1 1 6 6 1 1 1 5 7 6 1 1 1 6 1 1 1 1 1 1 1
symmnumber: 1
zpe: 669941.0 jmol-1
zpe.correction: 0.255167 hartree
zpe.thermalcorrener: 0.267782 hartree
zpe.thermalcorrenthalpy: 0.268726 hartree
zpe.thermalcorrgfe: 0.216554 hartree
zpe.sumelectzpe: -546.177164 hartree
zpe.sumelectthermal: -546.164549 hartree
zpe.sumelectthermalent: -546.163605 hartree
zpe.sumelectthermalfe: -546.215777 hartree
dipole: 5.8493 6.8132 0.7516
dipole: 9.0111
quadrupole: -61.9714 -101.6032 -88.5829
quadrupole: -0.1789 1.7256 -0.4845
quadrupole: 22.0811 -17.5507 -4.5304 -0.1789 1.7256 -0.4845
hfenergy: -546.4323308 hartree
pointgroup: C01 [X(C12H16B1N1)]
dipole: 2.3013075 2.6805205 0.2957164 debye
polarizability: 236.4286244|12.1384045|232.2224838|9.4818769|8.8012724|120.3408322 unknown
InChI: InChI=1/C12H16BN/c1-14(2)11-8-4-6-9-5-3-7-10(13)12(9)11/h3-8,14H,1-2,13H3
charge 0 multiplicity 1
30 atoms
C  1.11891583 1.80095061 0.23599531
C  0.83426906 0.46865054 0.11098383
C  -0.48985825 -0.04850376 -0.01327242
C  -1.52615805 0.94013077 -0.01337107
C  -1.21331128 2.31673768 0.1125044
C  0.07763217 2.74620482 0.23755887
H  2.14434637 2.13942643 0.3338007
C  -0.80865971 -1.4513144 -0.13253873
C  -2.87742353 0.53620716 -0.13846486
H  -2.02904158 3.03236359 0.10861704
H  0.30788995 3.80012648 0.33531901
C  -3.17926385 -0.78986856 -0.25768008
C  -2.15131161 -1.75512509 -0.25266844
H  -3.65414078 1.29362418 -0.13746667
H  -4.21203657 -1.1082889 -0.35506403
H  -2.42800552 -2.79998242 -0.34636824
B  0.24790102 -2.69196592 -0.11223412
N  1.97222041 -0.46819523 0.11436358
C  2.9263513 -0.2379349 -1.00068073
H  3.44722846 0.70736254 -0.85759727
H  3.64023239 -1.06114548 -1.01427025
H  2.36325291 -0.22143828 -1.93166647
C  2.6414698 -0.54762112 1.43808929
H  3.37937618 -1.34850767 1.40494962
H  3.12146785 0.40440758 1.66059641
H  1.88449048 -0.77552828 2.1852328
H  -0.31837652 -3.74960528 -0.29217987
H  0.84583268 -2.73600077 0.96563085
H  1.09292784 -2.57378199 -1.01574163
H  1.56736123 -1.42312106 -0.06821982
