program: Gaussian 16
title: H_H-H2
version: ES64L-G16RevC.01
method: RwB97XD
basis: GenECP
operation: Freq
keyword: #N
keyword: Geom=AllCheck
keyword: Guess=TCheck
keyword: SCRF=Check
keyword: GenChk
keyword: RwB97XD/GenECP
keyword: Freq
converged: YES YES NO NO
title: Mulliken charges:
elementType: C C H C N N B H H H H H H H C H
charge: -0.383927 -0.200754 0.227913 -0.049405 0.010619 -0.201544 -0.277930 -0.124919 0.425199 0.217793 0.160156 0.222615 -0.112898 -0.122645 -0.046867 0.256594
chargesum: 0.00000
title: Mulliken charges with hydrogens summed into heavy atoms:
elementType: C C C N N B C
charge: 0.216636 0.027159 -0.049405 0.010619 0.223655 -0.638391 0.209726
1716.lowfreq: -5.7383 -0.0008 -0.0006 0.0005 17.8265 19.8881 79.1915 86.5307 163.8870
frequency: 78.7558 86.0739 163.8830 221.4539 279.4819 381.2202 555.2168 624.6911 636.7622 715.1340 721.2304 754.4166 819.5180 852.3360 901.7545 1001.0908 1055.7011 1102.1410 1133.3985 1157.0752 1165.0723 1166.4930 1171.6124 1183.6169 1246.8631 1366.6545 1420.0782 1447.7518 1467.6633 1487.2901 1519.5087 1600.4677 1650.3468 2353.9524 2366.4895 2414.4280 3078.5843 3164.1290 3179.6740 3296.6734 3303.4060 3678.0532
redmass: 1.0524 1.1077 2.4919 2.3697 3.2446 2.5381 3.7350 2.8205 2.8953 1.2037 4.0267 1.2116 1.3855 1.4074 1.8355 4.1456 3.9944 1.5522 1.3481 1.3263 1.2241 1.0950 1.1034 1.5462 1.7612 4.3987 2.3797 3.2437 1.2213 1.0356 1.1364 5.2637 4.0771 1.0451 1.1033 1.0996 1.0326 1.1068 1.1060 1.0990 1.1031 1.0828
irintensity: 0.2160 0.9830 0.4805 15.2087 3.5692 6.2510 21.4843 21.4278 18.5757 67.5092 0.4230 57.8904 21.0488 11.3256 2.9555 17.9264 1.2940 2.5074 30.9932 0.4976 42.5854 11.0689 11.0921 74.0935 1.6118 33.3207 14.7677 4.1130 6.0361 16.2072 5.9910 123.1635 29.1467 245.5465 376.8496 336.2999 25.4454 5.5838 5.6037 5.1532 13.5002 134.6396
temp: 298.150 k
press: 1.00000 atm
elementType: 6 6 1 6 7 7 5 1 1 1 1 1 1 1 6 1
symmnumber: 1
zpe: 346738.5 jmol-1
zpe.correction: 0.132066 hartree
zpe.thermalcorrener: 0.139592 hartree
zpe.thermalcorrenthalpy: 0.140536 hartree
zpe.thermalcorrgfe: 0.100282 hartree
zpe.sumelectzpe: -292.021230 hartree
zpe.sumelectthermal: -292.013704 hartree
zpe.sumelectthermalent: -292.012759 hartree
zpe.sumelectthermalfe: -292.053013 hartree
dipole: 8.2268 8.1443 -4.4966
dipole: 12.4189
quadrupole: -61.6179 -63.9852 -48.7374
quadrupole: -25.4171 12.8752 4.9573
quadrupole: -3.5044 -5.8717 9.3761 -25.4171 12.8752 4.9573
hfenergy: -292.1532952 hartree
pointgroup: C01 [X(C4H9B1N2)]
dipole: 3.236666 3.204223 -1.7691065 debye
dipolederiv: 0.687716 0.1057272 -0.0117601 0.093689 0.1934959 0.0340161 -0.0150796 0.0331688 0.2059451 -0.1747707 -0.3006769 0.2001456 0.1593253 -0.1159577 -0.0155362 -0.111026 -0.0672587 -0.1341812 0.0622243 0.01601 -0.0262556 0.0089391 0.1161328 0.0572494 -0.0222558 0.058908 0.15777 0.3989887 0.4162506 -0.2215023 0.1354753 0.0909111 -0.0999561 -0.0313394 -0.0695028 -0.0460238 -0.8097203 -0.101187 -0.011853 -0.1245229 0.0740666 -0.1516822 0.0153974 -0.1461337 -0.0301998 -0.6884318 -0.013579 -0.0444998 -0.0997308 -0.1404517 -0.0671825 0.0149492 -0.0583362 -0.1763779 0.2803036 -0.0880108 0.0413058 -0.0113243 0.4045605 0.0036238 -0.0133211 -0.0083804 0.4182891 -0.3629494 0.0552356 0.175023 0.1426685 -0.3102964 -0.1309808 0.2161077 -0.0678085 -0.2492215 0.3320744 -0.0035381 0.0028355 -0.0399534 0.2843761 0.0182725 0.0252498 0.024343 0.305624 -0.0291072 -0.0141386 0.0106515 0.0716657 -0.0130457 -0.0609712 0.0426917 -0.0475872 0.0809105 0.0216389 0.0353545 -0.0385892 -0.0488709 -0.0098263 0.0819021 0.0223306 0.0911939 0.0501223 -0.0194342 -0.0258487 0.0120707 -0.0336801 0.0974525 -0.0133559 -0.0748767 -0.0365349 -0.0478458 -0.2365007 0.138584 -0.1092972 0.0308394 -0.3714883 0.177968 -0.0352885 0.1910731 -0.2507059 -0.2736268 -0.1368815 -0.0955617 -0.1548012 -0.2222902 -0.0595177 -0.1833593 -0.1300935 -0.4227867 0.7246048 -0.0401676 0.1013098 -0.1110661 -0.21489 0.185524 0.1500024 0.1940741 -0.0364319 0.0869903 -0.0431335 0.0159772 -0.0186526 0.1372506 0.0406268 -0.0001824 0.038875 0.1751136 unknown
polarizability: 107.9341487|9.1537412|88.805893|-1.105818|-14.5491521|75.0629892 unknown
InChI: InChI=1/C4H9BN2/c1-7-2-4(5)6-3-7/h2-3,6H,1,5H3
charge 0 multiplicity 1
16 atoms
C  1.63316942 -0.04801881 -0.09225524
C  -0.31713672 -1.48025423 0.64048062
H  0.31497204 -2.16907366 1.17457308
C  -1.67689696 -1.47799416 0.48248649
N  0.22109639 -0.3916967 -0.02898619
N  -1.90305642 -0.35155618 -0.29874104
B  -2.8628126 -2.4353098 0.98309687
H  -3.64901763 -1.76117744 1.6409553
H  -2.82048336 -0.06136894 -0.60025808
H  2.19056381 -0.87961392 -0.52246046
H  1.7611548 0.83349408 -0.71803968
H  2.00379776 0.16279695 0.91066225
H  -2.39513946 -3.33871787 1.65642475
H  -3.43845461 -2.88015733 -0.00486367
C  -0.76959467 0.28309278 -0.59470781
H  -0.66685548 1.17870395 -1.18346891
