program: Gaussian 16
title: h_quinoline_h2
version: ES64L-G16RevC.02
method: RwB97XD
basis: GenECP
operation: Freq
keyword: #N
keyword: Geom=AllCheck
keyword: Guess=TCheck
keyword: SCRF=Check
keyword: GenChk
keyword: RwB97XD/GenECP
keyword: Freq
converged: YES YES YES YES
title: Mulliken charges:
elementType: C C C C C C H C H H C C H H H N B H H H H
charge: -0.216339 0.329707 -1.281100 0.329091 -0.353808 -0.474177 0.254602 1.124354 0.207251 0.233603 -0.976345 0.199533 0.282282 0.261107 0.296505 0.217135 -0.470977 -0.061308 -0.045852 -0.138345 0.283081
chargesum: -0.00000
title: Mulliken charges with hydrogens summed into heavy atoms:
elementType: C C C C C C C C C N B
charge: 0.038263 0.329707 -1.281100 0.329091 -0.146557 -0.240574 1.406637 -0.715238 0.496039 0.500216 -0.716482
chargesum: 0.00000
1716.lowfreq: -13.6390 -7.4063 -0.0004 -0.0003 0.0004 10.9040 90.8939 140.1186 172.2508
frequency: 90.8830 140.1055 172.2489 228.3547 271.1911 398.7605 423.6254 471.3420 479.3006 523.8097 531.2274 571.4824 630.6447 693.8204 754.6802 774.7490 810.4930 832.6092 857.0885 862.5454 896.3318 910.6797 962.7710 1006.0209 1020.0240 1025.5260 1030.1880 1075.0619 1089.5208 1150.7413 1169.4667 1176.8216 1186.6491 1206.1798 1238.4320 1253.5998 1268.7891 1321.9028 1378.6493 1436.7433 1440.8738 1478.9786 1518.3543 1597.3633 1650.9544 1655.0732 1698.9751 2278.8646 2341.0072 2430.8908 3185.4922 3197.8533 3200.7135 3212.7129 3237.6147 3250.2116 3416.4568
redmass: 1.1518 2.5856 4.0831 3.0063 2.5457 3.1382 3.3690 3.2393 5.0202 2.8783 5.6966 5.9462 3.3301 5.3019 1.5847 1.9272 3.1771 1.3985 2.8464 1.4069 2.3302 1.4940 1.4248 1.3416 1.3528 1.3713 3.5747 2.4765 2.0015 1.2353 1.2937 1.0562 1.3357 1.1221 1.5732 1.9225 1.6726 1.8638 2.5225 2.2458 5.5694 2.3645 2.4350 2.7173 5.4552 6.2998 5.5630 1.0764 1.0732 1.0941 1.0877 1.0908 1.0918 1.0978 1.0923 1.0993 1.0818
irintensity: 5.6519 11.5175 2.8315 1.1319 53.9493 4.6151 4.4737 0.2204 6.9302 17.7474 4.5752 4.5823 2.2943 4.3817 2.9874 11.3305 18.5778 147.0494 8.2444 5.6221 5.2007 14.2258 0.7183 9.1444 0.3806 1.0317 8.5718 4.1311 19.1691 56.7867 9.3943 4.8885 11.2015 53.7543 15.3029 2.1494 3.3304 1.8673 10.5334 74.4962 155.1731 27.3703 14.3575 111.8080 6.2771 12.6508 89.4385 307.5254 284.8556 333.7417 5.1104 14.6473 4.0527 19.0304 0.6951 0.0765 424.4863
temp: 298.150 k
press: 1.00000 atm
elementType: 6 6 6 6 6 6 1 6 1 1 6 6 1 1 1 7 5 1 1 1 1
symmnumber: 1
zpe: 443308.8 jmol-1
zpe.correction: 0.168847 hartree
zpe.thermalcorrener: 0.177574 hartree
zpe.thermalcorrenthalpy: 0.178518 hartree
zpe.thermalcorrgfe: 0.135272 hartree
zpe.sumelectzpe: -428.344489 hartree
zpe.sumelectthermal: -428.335762 hartree
zpe.sumelectthermalent: -428.334818 hartree
zpe.sumelectthermalfe: -428.378064 hartree
dipole: 8.9605 -6.0656 -0.0918
dipole: 10.8209
quadrupole: -59.1511 -72.9824 -72.6339
quadrupole: 17.8486 0.8690 -0.3649
quadrupole: 9.1047 -4.7266 -4.3781 17.8486 0.8690 -0.3649
hfenergy: -428.5133361 hartree
pointgroup: C01 [X(C9H10B1N1)]
dipole: 3.5253484 -2.3864082 -0.0360986 debye
dipolederiv: 0.2374791 -0.1964367 -0.0004038 -0.0020468 -0.3568585 -0.0260263 -0.0016798 -0.0132627 -0.1224769 -0.4102608 -0.2079159 -0.007306 -0.2283105 0.3800066 0.0574423 -0.0143398 0.0682432 -0.147805 0.4964529 0.4016837 0.0191574 -0.58465 -0.1948902 -0.0318502 0.0037506 -0.0021281 0.1365641 -0.5509447 -0.0138568 -0.0190618 0.8677314 0.0261497 0.0233072 -0.0092727 -0.000072 0.0425145 -0.1729262 0.093969 0.0105863 -0.0167274 0.0037588 -0.0076997 0.002935 0.0073071 -0.1952263 0.0322798 -0.0144125 0.001156 0.0883939 0.2998504 0.0164162 0.0062292 0.0055678 -0.0991031 -0.1008284 0.0186389 -0.0073712 0.0449651 0.0868615 0.0006418 -0.0026616 -0.0037927 0.1280826 0.7151532 0.2730028 0.0229442 0.1068225 0.4273783 0.004308 0.0245092 0.0106195 -0.0290874 0.0514882 0.081843 -0.0031011 0.0203831 -0.0577198 0.0003849 -0.0049749 0.0016029 0.1627173 -0.0059881 -0.1054046 -0.0064383 -0.1014577 -0.0301512 -0.0051876 -0.0065883 -0.0033279 0.1481401 -0.1180377 -0.1612698 0.0032168 -0.4798295 -0.6917665 -0.0149345 0.0091073 -0.000513 -0.1891277 0.0318902 -0.4758256 -0.002113 0.1157111 0.6610175 0.0056653 -0.0032926 -0.0064168 0.068615 0.0935113 0.017725 -0.0015341 0.063166 -0.0242814 0.0013244 -0.0038621 -0.0006152 0.1388695 -0.0136057 0.0110877 -0.0062831 0.0101265 0.1023355 0.0006401 -0.0064188 -0.0013143 0.1745864 0.0910936 -0.0118316 -0.0020721 -0.0319284 0.0550065 0.0005297 -0.0043847 -0.0003158 0.1588701 -0.2872983 0.4219564 -0.015916 0.2845795 -0.5547775 0.0205865 -0.0242902 -0.0049752 -0.1363893 0.4225188 -0.0259176 -0.0136045 -0.0059136 0.220525 -0.0419889 -0.0354296 -0.0899732 0.3699462 -0.1255663 -0.0014017 -0.0910059 0.0565562 -0.3039717 -0.0845676 -0.0409175 -0.1828207 -0.465802 -0.5271884 0.1673101 -0.0845742 0.0289955 -0.1865195 0.0019751 -0.0890489 0.041194 -0.123161 -0.3512074 -0.0706429 0.1741104 -0.0304285 -0.3385722 0.1004511 0.14198 0.2043658 -0.2837952 0.491985 -0.202301 0.029614 -0.2061385 0.4766186 -0.0214178 0.0586503 -0.0293726 0.263068 unknown
polarizability: 206.7463961|6.0081091|173.1312987|3.5133764|1.894214|84.1324723 unknown
InChI: InChI=1/C9H10BN/c10-8-5-1-3-7-4-2-6-11-9(7)8/h1-6,11H,10H3
charge 0 multiplicity 1
21 atoms
C  -2.29369159 -0.30592886 -0.0764952
C  -1.39665925 0.74389679 -0.03460369
C  -0.03827036 0.33518267 -0.0060245
C  0.40341271 -1.01204726 0.00365719
C  -0.58050654 -2.02910608 -0.03147948
C  -1.9001783 -1.66661995 -0.07521191
H  -3.35414999 -0.07688835 -0.10592687
C  1.78914902 -1.2572113 0.05130919
H  -0.27576549 -3.06918523 -0.02368841
H  -2.66507569 -2.43504004 -0.10585501
C  2.69489716 -0.21827375 0.08332045
C  2.21877304 1.08981016 0.05744944
H  2.14235812 -2.28307443 0.06255856
H  3.76059714 -0.39514242 0.12061676
H  2.86599977 1.95638215 0.06533562
N  0.91604192 1.31423035 0.01617749
B  -1.7617062 2.31665879 0.03532105
H  -1.51754688 2.71267816 1.17395634
H  -2.92903642 2.51146468 -0.24693515
H  -1.0357478 2.94906364 -0.74392842
H  0.52832476 2.26200155 -0.03645621
