program: Gaussian 16
title: h_xanthene_h2
version: ES64L-G16RevC.02
method: RwB97XD
basis: GenECP
operation: Freq
keyword: #N
keyword: Geom=AllCheck
keyword: Guess=TCheck
keyword: SCRF=Check
keyword: GenChk
keyword: RwB97XD/GenECP
keyword: Freq
converged: YES YES YES YES
title: Mulliken charges:
elementType: C C C C C C H H H C O C H H H C H H H C C C C C H C H H B N C H H H C H H H H H H H
charge: 0.447451 -0.289793 -0.730960 -0.156097 0.297145 -0.271301 0.224783 0.217281 0.163367 -0.007998 -0.083224 -0.458040 0.158995 0.176863 0.193378 -0.804995 0.191604 0.180995 0.204933 0.197094 -0.261244 0.215702 0.269232 -0.544259 0.201636 -0.664697 0.257382 0.184717 -0.370404 0.264716 -0.430611 0.225969 0.232344 0.251751 -0.396871 0.225839 0.199703 0.254481 -0.108983 -0.058430 -0.125410 0.325957
chargesum: -0.00000
title: Mulliken charges with hydrogens summed into heavy atoms:
elementType: C C C C C C C O C C C C C C C C B N C C
charge: 0.447451 -0.065010 -0.513680 0.007270 0.297145 -0.271301 -0.007998 -0.083224 0.071197 -0.227464 0.197094 -0.261244 0.417337 0.269232 -0.286877 -0.479979 -0.663227 0.590674 0.279453 0.283151
chargesum: 0.00000
1716.lowfreq: -12.0532 -0.0002 0.0006 0.0006 6.0310 12.3401 56.8328 59.0105 85.5348
frequency: 56.3682 58.8479 85.4255 90.0519 145.3703 157.8956 173.8677 197.1846 224.2666 237.3046 249.8437 263.1127 270.7376 293.2415 299.3089 302.9563 318.0676 345.8129 352.8841 359.4755 393.0190 411.8916 446.7057 449.6506 494.0657 520.1027 529.3902 552.3574 577.1993 583.2516 597.6212 614.0525 651.3689 681.5698 723.2586 765.0372 779.8830 788.4989 808.3166 820.1385 849.5122 856.8597 885.9442 889.0147 909.1923 936.9735 942.2033 951.9813 963.5871 997.8574 1003.9104 1005.2021 1032.9481 1045.3360 1080.2455 1096.5237 1104.9688 1122.8511 1150.6435 1168.8709 1178.4544 1182.7748 1190.1537 1193.4468 1199.4976 1206.3324 1211.2866 1229.5172 1244.2826 1276.0480 1285.9439 1296.1484 1300.8343 1324.0114 1337.1615 1353.0519 1398.8791 1423.6558 1447.8205 1451.7297 1461.7994 1479.5850 1483.9154 1485.5646 1487.8536 1498.7507 1501.6930 1506.2379 1510.9686 1511.5636 1518.4569 1526.6224 1532.1154 1560.9686 1635.6673 1659.8796 1674.5836 1697.1815 2156.9949 2353.6663 2405.9605 2946.5349 3040.2808 3051.1547 3083.5854 3089.2796 3119.7099 3125.9708 3133.8565 3136.1330 3172.0409 3184.1484 3186.8238 3189.2762 3195.3532 3199.4970 3204.6394 3210.9184 3217.6863 3227.5330
redmass: 3.4171 3.3344 3.4062 3.2203 3.1009 3.1363 2.9924 2.5628 2.3175 1.1582 1.2322 1.4790 1.5353 2.1969 3.2063 1.6118 2.2672 1.4316 3.5017 1.7997 4.3868 3.4975 4.1612 3.1158 3.8019 3.5935 4.8344 3.6179 3.9116 3.9606 4.3917 3.8368 3.9222 5.6970 3.5856 2.1916 1.9180 1.3666 2.7795 3.1728 3.0641 2.9323 2.6967 1.9261 4.3363 1.4365 1.4990 1.8294 1.9899 2.1824 1.3313 1.3494 1.3262 1.9147 1.2143 2.1641 2.0075 1.6401 1.7331 2.3649 1.5246 1.4118 1.9561 1.4077 1.6955 1.2033 1.4495 2.0937 2.2635 1.9109 2.5686 2.5277 2.1244 3.1631 4.5554 5.5040 1.2318 1.2520 1.3223 1.3942 1.7702 1.1705 1.0871 1.0553 1.0785 1.1446 1.6416 1.2702 1.0520 1.2788 1.1030 2.4682 1.7232 1.4297 5.8546 7.6876 7.7768 6.6893 1.0723 1.0697 1.0936 1.0842 1.0351 1.0363 1.0315 1.0324 1.1029 1.1019 1.1032 1.1025 1.0865 1.1086 1.1073 1.0928 1.1080 1.1078 1.0874 1.0937 1.0920 1.0970
irintensity: 4.0469 2.4364 20.9529 13.8232 13.7561 1.9919 1.4435 5.4337 6.8779 1.3100 0.7970 1.0055 3.5988 1.2472 0.3486 0.5571 5.5787 21.5156 0.0780 24.1928 6.1376 3.6548 4.8956 7.0035 1.6871 5.6611 4.4769 0.4234 10.2813 2.1763 5.8921 3.4654 6.3219 3.8384 0.5862 12.5075 48.4522 56.4351 17.3316 15.5329 19.4326 12.2712 10.9953 6.7961 13.3657 0.7847 1.1473 3.1889 6.5528 33.2888 0.9316 0.9761 0.2119 19.6488 5.8770 28.0075 14.4578 45.3763 28.1307 12.5580 19.6568 17.0365 51.9144 6.3177 4.3350 4.8576 14.1699 141.3163 1.5795 16.3788 21.7075 46.5121 0.6137 81.2668 24.5832 22.1399 12.2490 7.6750 27.1635 42.8724 151.3523 3.4589 23.0906 13.3087 10.9798 14.0401 7.5464 22.8473 22.8974 25.2525 15.3617 79.7231 9.0635 71.1733 5.2397 0.6217 8.7957 12.4248 755.1176 313.6706 410.6971 1054.5852 37.4730 27.5221 5.6762 5.6756 14.9186 50.0921 12.6546 33.1886 6.3951 0.6736 2.3297 37.6486 1.5166 1.1708 1.2283 25.2365 8.5903 6.8835
temp: 298.150 k
press: 1.00000 atm
elementType: 6 6 6 6 6 6 1 1 1 6 8 6 1 1 1 6 1 1 1 6 6 6 6 6 1 6 1 1 5 7 6 1 1 1 6 1 1 1 1 1 1 1
symmnumber: 1
zpe: 937630.1 jmol-1
zpe.correction: 0.357124 hartree
zpe.thermalcorrener: 0.375248 hartree
zpe.thermalcorrenthalpy: 0.376192 hartree
zpe.thermalcorrgfe: 0.313101 hartree
zpe.sumelectzpe: -815.428213 hartree
zpe.sumelectthermal: -815.410089 hartree
zpe.sumelectthermalent: -815.409145 hartree
zpe.sumelectthermalfe: -815.472236 hartree
dipole: 8.2541 -9.5529 -0.3378
dipole: 12.6294
quadrupole: -85.8990 -147.0508 -122.9770
quadrupole: 6.9270 0.2871 1.0548
quadrupole: 32.7433 -28.4085 -4.3347 6.9270 0.2871 1.0548
hfenergy: -815.785337 hartree
pointgroup: C01 [X(C17H22B1N1O1)]
dipole: 3.2474138 -3.7584142 -0.1328822 debye
polarizability: 299.0182374|-1.327189|292.2446518|5.7830946|4.3249227|183.7001922 unknown
InChI: InChI=1/C17H22BNO/c1-17(2)11-7-5-9-13(18)15(11)20-16-12(17)8-6-10-14(16)19(3)4/h5-10,19H,1-4,18H3
charge 0 multiplicity 1
42 atoms
C  -1.0690923 2.36478668 -0.09468733
C  -2.29382183 2.76011407 -0.64669162
C  -3.33117555 1.85492359 -0.86352955
C  -3.17846312 0.50302655 -0.5647636
C  -1.98856372 0.05343577 0.00523115
C  -1.02309222 1.02131048 0.25236783
H  -2.42180764 3.79697029 -0.94320243
H  -4.26297747 2.19803558 -1.30165573
H  -3.98158267 -0.18945499 -0.78750736
C  -1.65575163 -1.40696723 0.34658275
O  0.18474963 0.59183934 0.81621599
C  -2.55362546 -2.39222032 -0.40195842
H  -2.30403551 -3.42212757 -0.13470795
H  -3.59871508 -2.23851629 -0.12617314
H  -2.46174107 -2.27847542 -1.48502483
C  -1.82625756 -1.62420624 1.86763365
H  -2.86801161 -1.45033098 2.14886241
H  -1.55636362 -2.64921158 2.13859067
H  -1.20099566 -0.93631191 2.44028929
C  -0.18101812 -1.61102682 -0.01058538
C  0.65952486 -0.53683165 0.25740272
C  0.40635728 -2.73752879 -0.57639361
C  1.99991092 -0.53189395 -0.09262867
C  1.77131878 -2.77096987 -0.86379657
H  -0.19749759 -3.60674858 -0.80766238
C  2.58200974 -1.66320706 -0.6399608
H  2.20473774 -3.66513599 -1.29466868
H  3.62898471 -1.68780022 -0.91529474
B  0.26643713 3.27750704 0.03859602
N  2.68173811 0.75522673 0.10838815
C  3.21199204 0.90457237 1.4954258
H  3.98346619 0.15278639 1.65884163
H  3.62026327 1.90858181 1.60008763
H  2.38623617 0.77013549 2.19003451
C  3.70867739 1.06593801 -0.9187761
H  4.00601888 2.10486516 -0.7874826
H  4.57053424 0.41321138 -0.79039696
H  3.26718603 0.93046492 -1.90381442
H  0.67597557 3.33418504 1.19471726
H  0.09472749 4.39738782 -0.41645284
H  1.16465244 2.7384331 -0.65607519
H  1.93749784 1.49537987 0.0006717
