program: Gaussian 16
title: Me_iPr-H2
version: ES64L-G16RevC.01
method: RwB97XD
basis: GenECP
operation: Freq
keyword: #N
keyword: Geom=AllCheck
keyword: Guess=TCheck
keyword: SCRF=Check
keyword: GenChk
keyword: RwB97XD/GenECP
keyword: Freq
converged: YES YES YES YES
title: Mulliken charges:
elementType: H C C C C H C H C H B C H H H C H H H N H H C C C H H H H H H C C C H H H H H H H H
charge: 0.231880 -0.559438 -0.400973 -0.530761 0.702080 0.213593 -0.398170 0.232488 0.309416 0.206559 -0.830469 -0.295522 0.194104 0.220095 0.204503 -0.328032 0.215232 0.215472 0.210122 0.233233 0.232412 0.144372 -0.028465 -0.662584 -0.630793 0.125981 0.158307 0.167902 0.138161 0.145528 0.152497 0.075638 -0.602123 -0.637997 0.165454 0.155199 0.152196 0.141261 0.154852 0.143821 0.135818 0.127150
chargesum: -0.00000
title: Mulliken charges with hydrogens summed into heavy atoms:
elementType: C C C C C C B C C N C C C C C C
charge: -0.327558 -0.187379 -0.298273 0.702080 -0.191611 0.309416 -0.598057 0.323180 0.312793 0.377605 0.107353 -0.210394 -0.194606 0.202788 -0.129274 -0.198063
1716.lowfreq: -7.5407 -0.0007 -0.0004 -0.0002 6.2484 9.8338 53.0478 62.0555 73.8216
frequency: 53.0195 62.0345 73.7282 91.3990 109.8782 133.2182 140.6503 146.2632 210.4481 223.8927 227.4986 232.4262 255.4104 265.4495 276.5731 282.1873 291.1679 295.4199 315.6145 355.0607 358.8784 398.1293 408.5967 430.0285 474.1825 508.5074 529.5614 575.5549 596.5402 632.0290 721.4554 762.5359 774.3407 792.1330 823.4103 849.6059 895.1589 920.6859 925.6733 927.2492 935.9287 954.3469 974.1302 977.8213 979.7374 1015.2061 1024.4281 1039.7982 1048.7005 1069.9295 1075.9233 1086.5559 1102.9575 1122.0910 1139.6127 1158.3554 1170.9274 1189.1068 1191.2740 1194.3607 1208.3485 1220.1872 1256.2217 1274.4237 1283.8907 1300.5421 1318.7178 1331.0016 1343.8533 1349.8266 1386.6579 1391.8216 1403.4018 1407.4746 1449.0767 1449.8680 1479.4967 1482.9202 1485.1635 1486.6199 1490.7346 1493.0950 1493.2567 1498.2775 1499.6432 1504.6244 1505.9581 1509.9174 1511.8582 1517.2735 1528.9233 1550.1122 1639.0156 1676.7849 2008.7570 2855.2568 2977.9884 2995.3792 2996.7981 2999.4394 3003.4016 3009.9982 3055.3684 3058.1963 3060.3985 3067.0907 3069.2413 3077.2941 3079.2686 3081.6126 3092.6994 3095.1909 3172.1336 3175.1883 3180.7204 3184.0681 3186.1299 3193.0339 3198.6141 3212.7849
redmass: 3.5109 3.4677 2.5990 2.6426 2.6899 3.1572 3.1762 2.9606 2.3104 1.6222 1.3421 1.4465 1.2791 1.5005 1.3354 1.2294 1.1380 1.7988 2.5417 3.1123 3.0228 2.2382 2.3948 2.5301 2.8019 3.4122 3.1575 3.4378 3.3490 4.3493 3.6083 1.9431 3.2307 2.3060 2.3369 2.7590 1.3849 1.4405 1.3598 1.3838 1.5034 2.9557 1.3454 1.3569 1.4537 1.9501 1.3673 1.3900 1.8029 1.7513 2.1944 1.2699 2.6957 2.0474 2.4045 1.8462 1.6598 1.3505 1.5945 1.7965 2.2044 1.5935 1.5005 1.6705 1.7049 1.8549 1.5064 3.2232 1.3216 1.2809 1.2671 1.2812 1.2350 1.2338 1.3474 1.1477 1.1552 1.1595 1.0606 1.0586 1.0539 1.0954 1.6891 1.0594 1.0468 1.0475 1.0604 1.0844 1.0563 1.1536 1.6142 1.1629 5.3114 5.6715 1.0690 1.0862 1.0803 1.0377 1.0365 1.0728 1.0394 1.0427 1.1010 1.1007 1.1004 1.1000 1.0983 1.0332 1.0962 1.0340 1.1005 1.0977 1.1066 1.1067 1.0861 1.1071 1.0903 1.1061 1.0935 1.0983
irintensity: 3.6830 0.6113 0.3457 1.1148 0.3944 3.8103 3.5028 4.2504 9.8871 1.8056 0.1188 0.7549 0.6690 0.7337 0.6288 0.2869 0.9741 0.2402 0.8535 2.0984 4.2868 0.7286 3.5993 3.1080 5.6534 4.4512 18.2145 9.1750 1.4436 2.4078 4.4283 44.1863 9.4473 15.9075 1.2306 0.9624 3.6540 1.4377 4.3450 0.0228 3.9353 22.5377 4.4072 0.2940 0.3434 35.3646 1.1030 13.8288 17.5429 6.0270 11.7224 0.7552 6.3596 14.1951 1.5590 7.3913 1.4265 1.8814 2.4058 0.4339 7.0525 58.9941 37.9818 24.1033 3.3524 12.7194 89.8513 10.0021 0.2419 1.0787 4.0816 6.2176 9.6486 1.9559 95.8122 3.3379 17.8069 2.5104 1.3287 5.1080 1.9754 2.9948 9.1245 2.0675 14.0989 13.4622 12.3361 21.8162 7.0690 4.7477 64.1948 10.3955 10.9056 5.0941 630.8333 1067.4966 43.0581 98.5800 69.2683 33.6711 118.5936 56.4374 34.6807 83.9877 120.7818 61.5134 104.9254 6.2142 73.8865 17.8470 64.0694 58.3974 3.6025 11.3721 3.4376 0.4898 5.7384 1.9436 25.5128 20.1752
temp: 298.150 k
press: 1.00000 atm
elementType: 1 6 6 6 6 1 6 1 6 1 5 6 1 1 1 6 1 1 1 7 1 1 6 6 6 1 1 1 1 1 1 6 6 6 1 1 1 1 1 1 1 1
symmnumber: 1
zpe: 996560.0 jmol-1
zpe.correction: 0.379570 hartree
zpe.thermalcorrener: 0.397745 hartree
zpe.thermalcorrenthalpy: 0.398690 hartree
zpe.thermalcorrgfe: 0.335194 hartree
zpe.sumelectzpe: -628.327003 hartree
zpe.sumelectthermal: -628.308828 hartree
zpe.sumelectthermalent: -628.307883 hartree
zpe.sumelectthermalfe: -628.371379 hartree
dipole: 2.4581 -8.8876 1.0569
dipole: 9.2816
quadrupole: -73.9939 -124.1905 -110.8681
quadrupole: -46.0486 4.6060 0.6167
quadrupole: 29.0236 -21.1730 -7.8506 -46.0486 4.6060 0.6167
hfenergy: -628.706573 hartree
pointgroup: C01 [X(C14H26B1N1)]
dipole: 0.9671105 -3.4966346 0.4158173 debye
polarizability: 224.3952032|4.2702671|242.646544|-0.750794|-6.5390253|186.6661346 unknown
InChI: InChI=1/C14H26BN/c1-11(2)15(12(3)4)13-9-7-8-10-14(13)16(5)6/h7-12,15-16H,1-6H3
charge 0 multiplicity 1
42 atoms
H  0.34407266 0.78213587 0.12547026
C  1.40890617 0.57562209 0.10138636
C  2.31161746 1.6200468 -0.03854135
C  1.85893951 -0.73856831 0.21735553
C  3.70266639 1.41977182 -0.07999879
H  1.93136491 2.63344279 -0.11050695
C  3.22178476 -0.98807462 0.19867565
H  1.15699384 -1.55672911 0.32806732
C  4.08864322 0.08772069 0.0495715
H  3.59261091 -2.00314486 0.3005791
B  4.75899173 2.65879092 -0.25915346
C  6.02522236 -1.02196644 -1.03838042
H  5.63349765 -0.6360375 -1.97704075
H  7.11496166 -1.00414916 -1.05060836
H  5.67331067 -2.04046627 -0.87770514
C  6.04615341 -0.56941866 1.39218743
H  5.62510338 -1.54017354 1.65095079
H  7.13407245 -0.62782354 1.35949999
H  5.73199476 0.17933192 2.11805848
N  5.54590368 -0.15145632 0.05974756
H  5.94385631 2.24607585 -0.05365582
H  5.9007945 0.83359776 -0.0946939
C  4.77652359 3.22129733 -1.80357795
C  5.13179277 2.1338387 -2.82302697
C  3.48482218 3.92608521 -2.23290402
H  6.10167354 1.67603809 -2.59169025
H  4.37587466 1.33702553 -2.82618083
H  5.19256855 2.52370621 -3.84729067
H  3.2027942 4.71596609 -1.5286178
H  3.58050827 4.3852039 -3.22547982
H  2.64852735 3.21930739 -2.28715773
C  4.50925781 3.78593154 0.90214602
C  4.67943413 3.19812831 2.30789367
C  5.41807218 5.00789681 0.74143261
H  5.70611685 2.8320487 2.44480959
H  4.49045868 3.93717323 3.09724101
H  4.00220843 2.35341643 2.47679855
H  5.27760535 5.73590754 1.55122216
H  6.47354606 4.70657389 0.74956545
H  5.23654671 5.52735916 -0.20427635
H  5.58086297 3.96968149 -1.84881706
H  3.46967844 4.14386345 0.826474
