program: Gaussian 16
title: MeQHBiPr-H2
version: ES64L-G16RevC.01
method: RwB97XD
basis: GenECP
operation: Freq
keyword: #N
keyword: Geom=AllCheck
keyword: Guess=TCheck
keyword: SCRF=Check
keyword: GenChk
keyword: RwB97XD/GenECP
keyword: Freq
converged: YES YES YES YES
title: Mulliken charges:
elementType: C C H C N N N B H H H H H C C C H H H H H H C C C H H H H H H H H
charge: -0.398039 -0.823007 0.286043 -0.073055 0.393421 -0.057773 -0.087117 0.022600 0.451062 0.215714 0.214379 0.223900 -0.108706 0.143831 -0.679161 -0.549276 0.152069 0.140247 0.135867 0.137128 0.155842 0.134236 0.187538 -0.767903 -0.605715 0.160059 0.151667 0.137491 0.136704 0.148747 0.140287 0.168518 0.112404
chargesum: -0.00000
title: Mulliken charges with hydrogens summed into heavy atoms:
elementType: C C C N N N B C C C C C C
charge: 0.255954 -0.536964 -0.073055 0.393421 -0.057773 0.363945 -0.086106 0.256235 -0.250978 -0.122069 0.356056 -0.318687 -0.179978
1716.lowfreq: -4.7355 -0.0004 0.0007 0.0007 8.4473 11.6170 43.7506 58.9285 61.5799
frequency: 43.2234 58.8898 61.3911 68.8580 84.4620 113.2145 151.1221 205.8743 232.5018 237.7490 249.7732 254.3078 272.7759 297.5782 311.7961 338.5625 370.3472 403.3913 407.2826 451.2028 483.7883 656.4533 688.8541 718.6870 742.6250 783.3140 795.5521 823.3846 840.0562 914.7867 921.6857 925.6345 935.7521 975.0498 980.6733 1008.4038 1025.5991 1047.3495 1082.2113 1086.8322 1094.0997 1107.0202 1140.4723 1145.5454 1160.6029 1170.3406 1187.9539 1193.7322 1239.9175 1273.6840 1295.7286 1317.9715 1346.3846 1347.3240 1388.6412 1394.1627 1404.3724 1404.8319 1408.6684 1451.5245 1457.7977 1484.4424 1485.2624 1487.5105 1490.1879 1492.0541 1496.1691 1499.6840 1503.9927 1505.1146 1507.5961 1519.7733 1599.1943 2278.3682 2956.1254 2997.4384 3000.3830 3002.5193 3005.7669 3008.1152 3052.7507 3057.3674 3061.8818 3065.4162 3076.5403 3082.1907 3088.7978 3091.4768 3096.0843 3178.9370 3203.2029 3307.4637 3653.6797
redmass: 3.0513 1.6527 2.3166 1.9600 2.5635 3.2970 3.0744 3.2775 1.5369 1.0798 1.4327 1.2845 1.2385 1.8377 2.8423 3.6853 2.6232 2.2607 2.4265 2.5366 3.0249 3.7107 5.4239 4.0121 3.1714 1.3614 2.0744 1.7477 1.6690 2.0191 1.2233 1.2203 1.5572 1.3543 1.3823 1.2968 1.7387 3.4814 2.0687 1.5697 2.4641 1.8268 2.3418 1.7575 1.3398 1.8312 1.9499 1.8577 2.1194 1.6204 1.8421 3.9493 1.2918 1.2881 1.2693 1.2801 2.6274 1.3429 1.3057 2.4010 1.4705 1.3950 1.1064 1.2405 1.1245 1.0596 1.0517 1.0503 1.0490 1.0453 1.0441 1.4579 3.5451 1.0827 1.0804 1.0366 1.0365 1.0379 1.0506 1.0696 1.1006 1.0994 1.0998 1.0991 1.1008 1.0996 1.0325 1.0980 1.0984 1.1070 1.1066 1.1011 1.0838
irintensity: 0.0281 0.9687 1.2417 0.2596 0.0420 1.5101 0.4564 0.2883 0.6210 0.1235 0.1725 0.3806 0.9110 0.5356 1.6992 2.6254 1.2657 2.4375 9.4045 2.0472 6.4563 4.1252 4.5718 6.0384 9.4023 75.3745 18.1559 1.2334 26.7814 0.6355 0.6306 1.2831 1.2398 1.5669 0.4648 25.8112 24.4131 16.8611 1.5641 16.4892 67.2819 17.7537 1.5681 4.8470 0.3369 40.9390 1.0487 3.0975 96.1618 10.6609 13.8384 1.5823 0.2763 0.5894 5.2821 6.4191 29.1712 14.5829 11.0881 11.8563 5.4920 15.4164 4.0255 5.8019 21.1136 1.0064 2.9796 6.2800 6.5918 4.5070 11.6380 4.3099 37.9951 341.2657 66.6406 69.9040 99.3237 95.3141 31.0843 69.6764 2.0638 192.9907 61.9457 97.3239 75.1963 62.6567 12.3831 57.7476 64.4598 2.1810 0.1451 5.0951 137.7058
temp: 298.150 k
press: 1.00000 atm
elementType: 6 6 1 6 7 7 7 5 1 1 1 1 1 6 6 6 1 1 1 1 1 1 6 6 6 1 1 1 1 1 1 1 1
symmnumber: 1
zpe: 767507.7 jmol-1
zpe.correction: 0.292328 hartree
zpe.thermalcorrener: 0.307711 hartree
zpe.thermalcorrenthalpy: 0.308655 hartree
zpe.thermalcorrgfe: 0.249691 hartree
zpe.sumelectzpe: -543.755820 hartree
zpe.sumelectthermal: -543.740437 hartree
zpe.sumelectthermalent: -543.739493 hartree
zpe.sumelectthermalfe: -543.798458 hartree
dipole: 7.7922 4.7602 -2.7755
dipole: 9.5436
quadrupole: -99.3909 -103.5048 -91.7789
quadrupole: -15.8025 13.9786 4.9655
quadrupole: -1.1660 -5.2800 6.4460 -15.8025 13.9786 4.9655
hfenergy: -544.0481486 hartree
pointgroup: C01 [X(C9H20B1N3)]
dipole: 3.0656852 1.8727951 -1.0919631 debye
polarizability: 172.1446367|14.6782745|163.1126805|-8.6408144|-10.7550202|163.7471261 unknown
InChI: InChI=1/C9H20BN3/c1-7(2)10(8(3)4)9-6-13(5)12-11-9/h6-8,10-11H,1-5H3
charge 0 multiplicity 1
33 atoms
C  1.62586039 0.1207127 -0.13249163
C  -0.3020274 -1.21114296 0.81027495
H  0.25769352 -1.59634794 1.64489604
C  -1.62078176 -1.40190986 0.43667271
N  0.25874557 -0.3813497 -0.10390799
N  -0.58387516 -0.01948961 -1.03097403
N  -1.69089115 -0.63904831 -0.68403211
B  -2.85619026 -2.2795947 1.00321935
H  -2.51667249 -0.51717351 -1.25437681
H  2.31453528 -0.7224213 -0.11694436
H  1.75325747 0.69184121 -1.04845134
H  1.79291817 0.75911661 0.73398368
H  -3.85859687 -1.83877484 0.42400643
C  -2.99703774 -2.03573242 2.61802986
C  -3.27830563 -0.56760512 2.95937332
C  -4.08562918 -2.92026303 3.23340585
H  -4.2225371 -0.2448473 2.50420644
H  -3.35919728 -0.39907003 4.04136161
H  -2.49323212 0.09826632 2.58190044
H  -4.21428567 -2.72934147 4.30695069
H  -5.0507155 -2.73216256 2.74686032
H  -3.8630336 -3.98465793 3.11164541
C  -2.63365556 -3.84891738 0.55546954
C  -2.50317258 -4.02127312 -0.96145071
C  -1.45745914 -4.53571521 1.25798105
H  -3.34534376 -3.55759049 -1.48666652
H  -1.58318772 -3.55246282 -1.33725627
H  -2.46423557 -5.07711489 -1.2589665
H  -1.55511732 -4.49335228 2.34741067
H  -1.36688446 -5.5922135 0.97412551
H  -0.50509132 -4.05532078 0.99497399
H  -3.54721366 -4.38002248 0.85746704
H  -2.04582561 -2.30538634 3.10853921
