program: Gaussian 16
title: H_Me-H2
version: ES64L-G16RevC.01
method: RwB97XD
basis: GenECP
operation: Freq
keyword: #N
keyword: Geom=AllCheck
keyword: Guess=TCheck
keyword: SCRF=Check
keyword: GenChk
keyword: RwB97XD/GenECP
keyword: Freq
converged: YES YES YES YES
title: Mulliken charges:
elementType: H C C C C H C H C H B N H H C H H H C H H H H H
charge: 0.223950 -0.341446 0.275167 -0.389586 1.023944 0.198780 -0.364569 0.218505 -1.220298 0.215888 -0.270658 -0.101993 -0.106706 0.270717 -0.561020 0.120000 0.128581 0.135030 -0.534863 0.123916 0.086455 0.149375 0.347558 0.373271
chargesum: -0.00000
title: Mulliken charges with hydrogens summed into heavy atoms:
elementType: C C C C C C B N C C
charge: -0.117496 0.473947 -0.171081 1.023944 -0.148681 -1.220298 -0.377364 0.889553 -0.177408 -0.175116
chargesum: 0.00000
1716.lowfreq: -12.2980 -4.0973 -0.0003 -0.0003 0.0005 24.9883 81.5541 103.2375 176.6419
frequency: 81.3274 103.2027 176.6253 211.4784 219.4178 223.9536 251.4962 311.5350 322.8063 381.5334 442.7140 449.5112 497.4517 546.3223 568.1537 686.9567 737.8918 758.9900 763.6763 779.8998 818.4576 824.9682 887.8344 911.7648 960.2580 978.4365 1022.8309 1029.0426 1060.5349 1070.2228 1088.8513 1115.0446 1126.8857 1169.9934 1189.2298 1198.3643 1260.2270 1302.8285 1315.3399 1321.8564 1343.2699 1463.9187 1476.6557 1477.2513 1480.1389 1484.5642 1491.0847 1514.1335 1616.7771 1643.0776 1655.7300 1682.8290 1995.3357 2842.2337 2980.0077 2994.7648 3038.5256 3053.8673 3068.8187 3070.9161 3178.7680 3183.2746 3196.0264 3213.3898 3503.7613 3574.2771
redmass: 2.7869 3.1496 1.7675 1.5252 2.0105 1.0684 2.5408 3.0534 1.1706 2.3885 2.8496 2.7748 3.3669 3.3716 4.4304 4.1694 2.1927 1.4426 1.2690 1.9947 1.8040 2.7295 1.3233 1.5064 1.6384 1.5477 1.3357 2.4698 1.8966 1.7404 1.8440 1.6043 1.8024 1.7147 1.1982 2.3981 1.3628 1.6921 1.3118 1.3749 2.6965 1.0552 1.1018 1.2784 1.1250 1.0642 1.7025 2.2296 1.4183 2.6089 1.2286 3.0439 1.0700 1.0769 1.0427 1.0381 1.0910 1.0970 1.0999 1.0991 1.0865 1.0902 1.0936 1.0978 1.0528 1.0936
irintensity: 3.3456 0.4648 9.6125 12.1636 12.3547 0.5742 18.4145 5.6513 6.0684 46.0671 12.6985 6.3898 11.3584 1.0942 2.8421 1.3900 11.2884 20.5022 56.2345 2.1503 3.4634 1.5593 4.6013 16.5229 8.8487 5.3062 0.2919 15.9002 19.9779 82.0909 33.1782 7.6548 53.4855 2.8395 3.8906 39.4211 138.5455 11.7765 49.3566 49.8574 16.2685 1.6420 14.7881 130.1120 27.1678 1.8799 24.7275 46.0118 22.8219 6.3000 20.3666 2.7944 596.8761 801.7142 107.6998 36.7420 96.3417 71.7299 32.4097 139.5046 5.5641 4.4814 27.1172 18.3648 67.7885 79.0026
temp: 298.150 k
press: 1.00000 atm
elementType: 1 6 6 6 6 1 6 1 6 1 5 7 1 1 6 1 1 1 6 1 1 1 1 1
symmnumber: 1
zpe: 546641.4 jmol-1
zpe.correction: 0.208205 hartree
zpe.thermalcorrener: 0.218643 hartree
zpe.thermalcorrenthalpy: 0.219587 hartree
zpe.thermalcorrgfe: 0.173201 hartree
zpe.sumelectzpe: -392.631927 hartree
zpe.sumelectthermal: -392.621488 hartree
zpe.sumelectthermalent: -392.620544 hartree
zpe.sumelectthermalfe: -392.666930 hartree
dipole: 2.9946 -8.2361 -0.0230
dipole: 8.7636
quadrupole: -28.1777 -84.3357 -69.6432
quadrupole: -40.1257 -0.9418 0.4989
quadrupole: 32.5412 -23.6168 -8.9244 -40.1257 -0.9418 0.4989
hfenergy: -392.8401313 hartree
pointgroup: C01 [X(C8H14B1N1)]
dipole: 1.1781618 -3.2403256 -0.0090373 debye
dipolederiv: -0.1325917 -0.0018398 0.0348647 0.0112735 0.0786843 0.0001062 0.031663 -0.0007547 0.1454505 0.1341425 -0.0112873 -0.0324224 -0.0581471 0.1258145 -0.0056314 -0.025602 -0.0075095 -0.120735 -0.0662422 -0.3356925 0.0089618 -0.1016096 -0.0136686 0.026926 -0.0047633 0.0363961 -0.150821 -0.128186 0.0966284 -0.0016065 0.0518914 -0.0895183 0.0019148 -0.0098722 -0.012603 -0.1923512 -0.2027364 0.2380529 -0.0318871 0.1934903 -0.1112637 -0.0707575 -0.0312724 -0.0734313 -0.1438486 0.052487 0.0817057 0.0138023 0.1078579 -0.0426455 -0.0082054 0.0084654 -0.0014647 0.122219 0.0362923 -0.0477173 -0.0191902 0.0380776 -0.0335685 -0.0155402 -0.021157 0.0142909 -0.1249906 0.0229359 -0.0880092 0.0182627 -0.0899269 -0.05431 0.0146026 0.0158025 0.0161797 0.1594823 0.581751 0.036261 -0.0834314 -0.2554884 0.0544915 0.0514909 -0.1055852 0.0064414 -0.0806066 0.0289156 0.0926513 0.0096809 0.079597 -0.0634402 -0.0040481 0.0108663 -0.0024438 0.1616007 0.6549843 -0.1194679 0.0533717 -0.0116878 0.6172647 -0.0022775 0.141724 -0.0133134 0.5604592 -0.4791605 -0.0962447 0.0448898 0.1185027 -0.7148426 -0.0906367 0.1293212 -0.1714661 -0.0258176 -0.5669126 0.1867487 -0.1629431 0.1045016 -0.4539304 0.0572265 -0.1983798 0.0518831 -0.2659436 0.2054244 -0.0129388 0.0059128 -0.1126098 1.0429647 0.0720925 -0.022714 0.1826921 0.1605661 -0.0878766 0.133447 0.096455 0.075634 -0.3482068 -0.1543219 0.044349 -0.106058 -0.0795297 -0.1730848 0.1375908 -0.0988722 0.0843179 0.019822 0.0269146 -0.1179574 0.0493382 -0.0045697 0.0347806 0.012358 0.0856635 -0.0029228 0.0717522 0.0354321 0.0856874 -0.0133635 -0.2590866 -0.0484068 -0.1995696 -0.0053675 -0.1561656 -0.1834068 0.0038302 0.0086955 0.0215215 0.0683834 -0.052394 -0.0680676 0.0668177 -0.0884417 -0.0876252 0.0898115 0.045445 0.0290269 -0.3649101 -0.086156 -0.1756922 0.070874 -0.1772173 -0.1542608 0.0887156 0.0706673 0.0927756 0.0356122 -0.0150416 0.1143152 0.0857596 0.1466928 -0.1867346 -0.1813046 0.0584374 -0.1388417 -0.0464217 -0.1231253 0.0817271 -0.1696814 0.0473117 0.0364136 0.0461434 -0.1061238 0.044839 -0.0412509 0.2324607 -0.0398485 0.0334461 -0.0059377 0.2192217 -0.0038848 0.026416 -0.0083256 0.2335384 0.1777404 -0.0151106 -0.0233607 0.0010062 0.2709928 0.0214012 -0.0341127 0.0041909 0.2535712 unknown
polarizability: 150.0454448|7.3739052|163.681162|-9.4330874|-3.5591633|101.953356 unknown
InChI: InChI=1/C8H14BN/c1-9(2)7-5-3-4-6-8(7)10/h3-6,9H,1-2,10H3
charge 0 multiplicity 1
24 atoms
H  0.43434969 0.36754626 0.46425818
C  1.50860331 0.28096263 0.33877909
C  2.28630445 1.42847331 0.23489544
C  2.09360952 -0.98310854 0.29052642
C  3.67830067 1.37681615 0.07080957
H  1.80415019 2.39943129 0.28697876
C  3.46901719 -1.08755384 0.13506692
H  1.4869805 -1.8768056 0.37681705
C  4.19878688 0.08627058 0.02719071
H  3.95328747 -2.05882484 0.09961293
B  4.65315309 2.67723453 -0.10895561
N  5.66526527 0.02422273 -0.13317783
H  5.74642427 2.40372155 0.48284429
H  5.9774688 1.00594026 0.12279343
C  4.05360228 4.01909118 0.58154017
H  3.1344733 4.35742446 0.08151299
H  3.80894259 3.88745881 1.64356124
H  4.76344912 4.85290942 0.51552332
C  4.98505301 2.88736978 -1.70145033
H  5.68822235 3.71479334 -1.85920061
H  5.41733297 2.00836312 -2.2048044
H  4.07028665 3.13364408 -2.25736503
H  6.10788927 -0.66225931 0.47392466
H  5.94527518 -0.15608794 -1.09627631
