program: Gaussian 16
title: Pip_Me-H2
version: ES64L-G16RevC.01
method: RwB97XD
basis: GenECP
operation: Freq
keyword: #N
keyword: Geom=AllCheck
keyword: Guess=TCheck
keyword: SCRF=Check
keyword: GenChk
keyword: RwB97XD/GenECP
keyword: Freq
converged: YES YES YES YES
title: Mulliken charges:
elementType: H C C C C H C H H B H H C H H H C H H H C N C C C H H C H H C H H H H H H
charge: 0.219259 -0.404913 -0.134869 -0.511847 0.155060 0.201785 -0.116180 0.231749 0.199119 -0.385637 -0.032418 0.117394 -0.551537 0.123574 0.070014 0.150464 -0.545057 0.144381 0.117096 0.136284 0.020948 0.324907 -0.197773 -0.213736 -0.403145 0.272752 0.209871 -0.366046 0.237793 0.229852 -0.568523 0.237218 0.198460 0.243505 0.201126 0.235349 0.153722
chargesum: -0.00000
title: Mulliken charges with hydrogens summed into heavy atoms:
elementType: C C C C C B C C C N C C C C C
charge: -0.185654 0.066916 -0.280097 0.155060 0.082939 -0.418055 -0.207485 -0.147296 0.020948 0.442301 0.284849 0.253908 0.032533 0.078585 -0.179452
chargesum: 0.00000
1716.lowfreq: -3.9149 -0.0004 -0.0002 0.0002 10.1024 11.0445 50.2190 66.6109 80.0412
frequency: 50.1245 66.5824 80.0204 88.2717 118.3922 179.3332 205.2327 225.1790 233.6500 240.9970 257.0740 275.5732 297.5697 346.1940 362.2753 432.6274 460.9304 484.7888 506.1312 517.2365 532.2285 567.5918 648.3500 696.5479 742.6595 760.4715 778.7404 783.1363 801.6579 818.2870 820.2761 856.5092 890.2987 891.9915 915.0586 927.0440 930.8468 961.8437 976.8276 981.7077 1021.2738 1026.1441 1038.9291 1059.5380 1073.8615 1078.1783 1094.0027 1112.2469 1116.9253 1163.6301 1171.5443 1182.4370 1191.2399 1218.4216 1244.5366 1251.6683 1288.3194 1306.2501 1308.6772 1312.1685 1319.0484 1329.4960 1348.7003 1361.5841 1398.2353 1402.7299 1403.5006 1420.0563 1452.1298 1465.5153 1473.7809 1479.8642 1483.4971 1485.1753 1490.3849 1494.2987 1500.0597 1501.9805 1516.0915 1518.5719 1540.4384 1639.6693 1676.4028 2051.9671 2946.8675 2988.6844 2994.2749 3041.0395 3045.5329 3052.5635 3052.7747 3054.7829 3063.0723 3068.4095 3086.0233 3087.9464 3110.8990 3114.4726 3117.3366 3151.7184 3158.1781 3177.5684 3186.1267 3194.6919 3211.7202
redmass: 2.6718 3.0800 3.1183 3.2621 3.4311 2.2092 1.2587 1.1594 1.9970 2.6075 2.0304 3.0072 2.8520 3.2174 1.8707 2.8645 2.9860 2.8642 2.8561 2.7468 1.8682 3.5222 4.5017 3.5477 1.3177 1.5791 2.1429 1.9021 2.2372 1.5997 1.4955 3.3144 1.4505 1.3790 1.5497 2.0375 2.7777 1.7281 1.4755 1.4398 1.3258 2.4894 2.6716 1.8508 2.1926 1.7024 2.0517 2.3425 2.9039 1.0929 1.7902 1.7953 1.2853 2.4868 1.5516 1.4268 1.3206 1.4524 1.3391 1.2482 1.5443 2.1323 1.2901 1.2915 1.4828 1.4028 1.4129 1.4158 1.4014 1.0531 1.0690 1.0592 1.1008 1.0944 1.4643 1.3194 1.1014 1.1524 1.2663 1.3343 1.3445 5.3058 5.6341 1.0713 1.0837 1.0366 1.0379 1.0694 1.0974 1.0755 1.0876 1.0645 1.0997 1.0992 1.0635 1.0632 1.0957 1.0982 1.1003 1.1071 1.1043 1.0858 1.0893 1.0940 1.0981
irintensity: 1.6802 0.9686 2.3934 1.2951 0.4549 8.0009 5.7208 3.6461 2.8809 2.7909 3.3963 0.1976 1.2690 1.8681 6.8069 4.2794 2.2874 5.8872 11.8013 6.5129 3.6847 4.5774 1.1153 0.3653 21.6347 29.8476 3.0495 24.9448 0.3670 2.8227 1.2221 1.1144 7.8486 6.0806 14.2253 4.3312 4.0262 6.2509 4.8761 2.0371 0.2280 34.6351 10.1884 6.8847 14.2103 7.3125 29.6508 26.5576 4.5691 3.3461 3.6901 8.4286 4.2563 45.6302 19.6360 125.9503 7.1388 11.4121 15.8248 21.4660 67.3414 0.8582 2.3382 0.3711 1.1371 0.1594 0.0619 11.1506 164.4204 0.9910 2.9298 5.1820 1.4281 8.3339 4.9478 16.5666 18.8461 23.9216 23.5533 19.2235 27.2601 16.5257 6.5045 639.6935 846.7937 95.0781 14.6636 24.4429 94.2157 7.6806 79.4855 32.4491 63.6394 120.6399 1.8194 9.9065 35.6152 27.9874 27.4056 3.8578 3.3226 4.1766 4.4287 36.9949 21.6702
temp: 298.150 k
press: 1.00000 atm
elementType: 1 6 6 6 6 1 6 1 1 5 1 1 6 1 1 1 6 1 1 1 6 7 6 6 6 1 1 6 1 1 6 1 1 1 1 1 1
symmnumber: 1
zpe: 871049.6 jmol-1
zpe.correction: 0.331765 hartree
zpe.thermalcorrener: 0.346617 hartree
zpe.thermalcorrenthalpy: 0.347561 hartree
zpe.thermalcorrgfe: 0.290466 hartree
zpe.sumelectzpe: -587.867706 hartree
zpe.sumelectthermal: -587.852855 hartree
zpe.sumelectthermalent: -587.851910 hartree
zpe.sumelectthermalfe: -587.909005 hartree
dipole: 4.2392 -8.7481 2.3060
dipole: 9.9909
quadrupole: -42.1677 -114.2345 -96.8648
quadrupole: -44.2413 13.9732 0.9528
quadrupole: 42.2547 -29.8122 -12.4425 -44.2413 13.9732 0.9528
hfenergy: -588.1994713 hartree
pointgroup: C01 [X(C13H22B1N1)]
dipole: 1.6678465 -3.4417576 0.9072589 debye
polarizability: 227.0732674|-5.0208384|212.543229|-0.9652419|-14.9772828|160.8926044 unknown
InChI: InChI=1/C13H22BN/c1-14(2)12-8-4-5-9-13(12)15-10-6-3-7-11-15/h4-5,8-9,14-15H,3,6-7,10-11H2,1-2H3
charge 0 multiplicity 1
37 atoms
H  0.388191 0.52573989 0.14748656
C  1.46359755 0.3894132 0.1961656
C  2.30835766 1.468634 -0.03147397
C  1.98477386 -0.86904424 0.48938422
C  3.7062895 1.3539894 0.01603777
H  1.87403055 2.43843221 -0.25308046
C  3.36085958 -1.03301419 0.5528204
H  1.32781013 -1.71234485 0.66757413
H  3.78606548 -2.00530157 0.78006864
B  4.72726839 2.59459857 -0.30986548
H  5.7948802 2.40609005 0.34492567
H  5.93207132 0.93327124 0.2311172
C  5.10656955 2.5827904 -1.90533805
H  5.79808751 3.39774615 -2.15555118
H  5.57826947 1.65297175 -2.25581578
H  4.20820635 2.72357241 -2.52237459
C  4.12689755 4.03018473 0.16654814
H  4.85896255 4.83393163 0.01813441
H  3.23651679 4.31500954 -0.4125403
H  3.83743381 4.0489674 1.22551537
C  4.16697973 0.07197124 0.31462784
N  5.63263987 -0.06702149 0.36559018
C  6.15840623 -0.47878644 1.70256972
C  6.19367331 -0.8956759 -0.74389878
C  7.67726478 -0.38589258 1.7190725
H  5.6987147 0.18521687 2.4348611
H  5.81573029 -1.49870727 1.89219418
C  7.71121709 -0.80341755 -0.75562821
H  5.74902128 -0.52526165 -1.66675381
H  5.85525777 -1.92250651 -0.58229185
C  8.29958296 -1.21280279 0.59435799
H  8.03189823 -0.72098894 2.69619388
H  7.97027781 0.66495136 1.61573728
H  8.08893549 -1.43989682 -1.55875083
H  8.0042971 0.22441933 -0.99781337
H  9.38385037 -1.08366474 0.58832331
H  8.10395223 -2.2773009 0.77083383
