program: Gaussian 16
title: Pyrr_Me-H2
version: ES64L-G16RevC.01
method: RwB97XD
basis: GenECP
operation: Freq
keyword: #N
keyword: Geom=AllCheck
keyword: Guess=TCheck
keyword: SCRF=Check
keyword: GenChk
keyword: RwB97XD/GenECP
keyword: Freq
converged: YES YES YES YES
title: Mulliken charges:
elementType: H C C C C H C H C H B H C H H H C H H H N C C C H H C H H H H H H H
charge: 0.218194 -0.383156 -0.176808 -0.582998 0.209450 0.200796 -0.112223 0.230589 0.046189 0.204849 -0.320679 -0.046748 -0.558651 0.119438 0.131868 0.138510 -0.573118 0.119347 0.087811 0.145755 0.447084 -0.254645 -0.261026 -0.464385 0.195438 0.256987 -0.391755 0.167018 0.231799 0.204623 0.233254 0.227610 0.190573 0.119010
chargesum: -0.00000
title: Mulliken charges with hydrogens summed into heavy atoms:
elementType: C C C C C C B C C N C C C C
charge: -0.164961 0.023988 -0.352410 0.209450 0.092626 0.046189 -0.367427 -0.168836 -0.220204 0.566094 0.197779 0.137791 -0.026508 0.026429
1716.lowfreq: -0.0006 -0.0005 0.0002 6.1910 10.6499 16.8306 39.7293 52.1374 76.5735
frequency: 39.6158 52.0496 76.4841 89.7830 121.8849 128.8010 187.3292 216.1878 227.5211 231.5056 253.8538 288.3435 334.2904 349.2617 438.2490 498.3893 513.5339 549.9600 564.4820 623.9528 658.9531 703.4120 740.5711 760.9034 781.1751 787.7244 807.7793 815.6296 831.0891 885.4442 893.8521 917.7876 923.4497 954.5614 962.5654 976.5474 984.1362 993.5154 1021.5600 1027.6903 1071.2500 1075.1150 1092.5602 1107.4051 1111.2445 1118.1715 1172.0153 1189.3264 1214.9801 1233.3617 1245.0255 1253.1486 1266.0298 1301.5933 1307.8656 1318.7299 1321.8085 1330.4876 1335.4804 1348.5354 1382.3053 1396.3759 1462.0900 1466.2899 1475.5893 1481.2476 1484.4266 1493.3893 1495.8249 1506.8406 1509.1755 1519.4455 1528.6869 1541.0687 1640.2587 1675.8601 2018.0045 2890.7468 2987.7144 2994.1086 3045.5594 3052.7911 3061.9264 3068.7015 3080.2369 3094.3589 3097.5120 3113.5558 3138.8202 3150.2263 3165.7487 3174.8434 3177.1407 3183.9906 3194.2797 3211.9071
redmass: 2.0812 2.6104 3.0000 2.9256 3.1277 2.4748 1.8520 1.3069 1.0722 2.3219 2.9203 2.5802 3.5003 3.4076 3.4068 3.1414 2.6191 2.4427 3.5264 2.4572 5.5034 3.9022 1.2429 1.6976 1.7759 2.0816 1.2156 1.6514 2.4499 2.4705 1.3669 1.5407 2.6201 2.1595 1.9912 1.7948 1.6049 1.5943 1.3258 2.4389 2.3313 2.0056 2.0090 1.8798 2.1231 4.6467 1.6718 1.1734 1.9097 1.4464 1.3894 1.3553 1.3501 1.4725 1.2848 1.2529 2.1270 1.7452 1.3686 1.2899 1.3881 1.4032 1.4659 1.0564 1.0577 1.0528 1.0555 2.0090 1.1250 1.0899 1.1342 1.4218 1.1014 1.3630 5.2239 5.6120 1.0698 1.0856 1.0364 1.0375 1.0981 1.0970 1.0997 1.0995 1.0666 1.0629 1.0609 1.0611 1.1025 1.1048 1.1085 1.1090 1.0861 1.0896 1.0938 1.0980
irintensity: 0.3553 1.5991 0.4471 0.5145 3.2439 7.0606 4.5201 7.9333 0.6552 5.2411 4.7412 0.7433 5.2658 1.3459 4.2262 12.3272 4.9311 4.9063 4.1615 2.6132 4.7216 1.6868 13.5833 34.2578 28.7210 1.2611 3.7140 1.9616 1.4768 11.4667 2.6518 14.1759 5.4083 17.9377 1.3641 3.1863 0.9987 0.9993 0.2502 31.4692 5.9368 5.6905 32.3309 2.6423 21.3161 10.5076 2.0441 0.2772 8.1357 37.4496 6.8665 94.4370 46.8819 14.1096 33.0173 7.5610 72.0205 5.1138 1.5843 4.2812 2.9365 1.9354 151.9379 4.1418 4.6152 2.1085 0.8274 4.3889 11.5844 9.5208 16.0153 34.7522 2.9918 42.6381 19.3236 7.1762 736.3924 1000.3473 83.0660 33.9589 96.1199 72.4382 78.0930 105.8969 18.9118 24.9926 7.4376 8.7266 7.5831 17.0846 3.8478 5.2568 6.6018 4.9099 34.9673 21.6096
temp: 298.150 k
press: 1.00000 atm
elementType: 1 6 6 6 6 1 6 1 6 1 5 1 6 1 1 1 6 1 1 1 7 6 6 6 1 1 6 1 1 1 1 1 1 1
symmnumber: 1
zpe: 793058.4 jmol-1
zpe.correction: 0.302060 hartree
zpe.thermalcorrener: 0.316237 hartree
zpe.thermalcorrenthalpy: 0.317181 hartree
zpe.thermalcorrgfe: 0.260764 hartree
zpe.sumelectzpe: -548.574663 hartree
zpe.sumelectthermal: -548.560486 hartree
zpe.sumelectthermalent: -548.559542 hartree
zpe.sumelectthermalfe: -548.615959 hartree
dipole: 4.4054 -9.0066 0.9541
dipole: 10.0716
quadrupole: -33.6099 -108.3502 -92.1311
quadrupole: -45.9181 5.4515 0.7565
quadrupole: 44.4205 -30.3198 -14.1007 -45.9181 5.4515 0.7565
hfenergy: -548.8767229 hartree
pointgroup: C01 [X(C12H20B1N1)]
dipole: 1.7332029 -3.5434698 0.3753824 debye
polarizability: 210.5387219|-4.6234273|205.2332253|-4.3262595|-6.9069509|145.4614005 unknown
InChI: InChI=1/C12H20BN/c1-13(2)11-7-3-4-8-12(11)14-9-5-6-10-14/h3-4,7-8,13-14H,5-6,9-10H2,1-2H3
charge 0 multiplicity 1
34 atoms
H  0.50116859 0.44834854 0.22377472
C  1.58022714 0.33760327 0.19651022
C  2.38768238 1.46006295 0.07229344
C  2.1440503 -0.93424343 0.28737495
C  3.78895924 1.37972063 0.03067227
H  1.92152311 2.4380837 0.00458967
C  3.52360861 -1.0656249 0.25437573
H  1.51600637 -1.81218657 0.38360025
C  4.29383828 0.08388411 0.12811217
H  3.98122383 -2.04771098 0.32125842
B  4.74934472 2.68826669 -0.1900637
H  5.90601824 2.42511222 0.26307264
C  4.21556674 3.98904895 0.63036789
H  3.2428121 4.33894717 0.2558048
H  4.09374043 3.80273604 1.70541989
H  4.90668846 4.83497912 0.52600173
C  4.89575767 2.97812199 -1.79551465
H  5.56732362 3.82353972 -1.99346331
H  5.27844571 2.1236466 -2.37216935
H  3.92139006 3.23357894 -2.23534725
N  5.75907802 -0.0196289 0.08993581
C  6.42958363 -0.64768306 1.26363808
C  6.35566611 -0.66598539 -1.12453758
C  7.87416596 -0.74346909 0.79919844
H  5.98236199 -1.62929868 1.43005548
H  6.26245527 -0.02087664 2.13866885
C  7.76032985 -1.12372473 -0.69143371
H  6.3463992 0.0664463 -1.92995999
H  5.71384622 -1.50053197 -1.40436183
H  8.36015262 0.22869933 0.91303044
H  8.44130866 -1.4709432 1.3788206
H  8.53904157 -0.64845021 -1.28686629
H  7.85480342 -2.20231819 -0.82379285
H  6.02767874 1.00158094 0.09511236
