program: Gaussian 16
title: me_biphenylene_h2
version: ES64L-G16RevC.02
method: RwB97XD
basis: GenECP
operation: Freq
keyword: #N
keyword: Geom=AllCheck
keyword: Guess=TCheck
keyword: SCRF=Check
keyword: GenChk
keyword: RwB97XD/GenECP
keyword: Freq
converged: YES YES NO YES
title: Mulliken charges:
elementType: C C C C C C C H C H H C H C H C C H B N C H H H C H H H C H H H C H H H H H
charge: 0.344636 0.153940 -0.132527 -0.068402 -0.266861 0.066984 -0.288378 0.217620 -0.619181 0.244325 0.210670 -0.489803 0.212005 -0.315832 0.220586 0.000386 0.179537 0.210219 -0.613435 0.157278 -0.513665 0.104451 0.132982 0.180303 -0.532969 0.128209 0.135290 0.151184 -0.395734 0.215495 0.240408 0.223195 -0.400347 0.231732 0.210957 0.253415 0.222639 -0.011310
chargesum: -0.00000
title: Mulliken charges with hydrogens summed into heavy atoms:
elementType: C C C C C C C C C C C C B N C C C C
charge: 0.344636 0.153940 -0.132527 -0.068402 -0.049241 0.066984 -0.044053 -0.408512 -0.277798 -0.095246 0.210604 0.179537 -0.624745 0.379918 -0.095930 -0.118286 0.283364 0.295757
chargesum: 0.00000
1716.lowfreq: -7.9540 -0.0006 -0.0006 0.0004 1.7214 8.1952 31.3792 78.7634 84.9001
frequency: 31.1657 78.7357 84.8542 98.1706 123.6248 131.7165 151.7286 167.7861 207.3543 212.0754 229.6486 231.0426 257.1994 273.8932 289.6126 298.9132 317.2804 370.1143 378.1724 398.7969 462.7904 478.9751 512.1455 540.6853 555.8320 599.9437 619.3880 640.9264 657.8564 726.4505 734.7651 748.7844 756.5958 773.2964 789.2159 790.5018 811.8375 824.5264 879.6945 894.2248 923.5837 933.7473 956.9674 973.9433 990.7251 1005.2225 1007.9655 1025.7671 1038.4278 1048.7678 1054.6242 1083.8660 1087.4955 1145.2584 1160.9511 1170.4078 1179.3544 1186.6036 1197.6103 1201.7991 1215.9072 1245.3161 1264.2395 1296.0797 1302.3659 1313.6392 1317.2163 1408.7276 1434.1045 1449.7720 1467.5425 1470.3449 1476.6571 1477.5016 1480.6697 1482.6605 1489.9434 1491.0309 1498.0203 1504.5757 1513.0058 1516.1913 1524.4120 1575.5726 1648.5594 1665.7011 1693.6119 1755.7041 2040.3558 2818.3597 2982.6989 2991.5280 3042.1879 3050.6486 3058.3343 3063.2136 3081.1780 3086.8092 3168.7216 3179.5229 3183.4032 3187.6446 3191.1323 3193.9525 3198.4452 3207.5187 3210.3228 3219.2348
redmass: 3.4102 3.5664 2.9768 3.0959 3.0343 2.8421 3.2618 3.2297 1.1152 1.2628 1.5271 1.3017 1.2523 3.1500 2.2841 3.4120 2.7472 4.3163 2.9907 4.6891 4.3297 3.1278 3.1622 3.2862 3.5126 5.2048 4.0184 4.2580 4.5352 2.8540 2.9394 5.1194 1.3633 1.6250 2.4948 1.3308 2.2915 2.1356 4.0396 1.4718 1.3591 1.4185 3.0199 2.1614 1.3146 5.9958 1.3528 2.2289 1.9524 2.3632 2.1617 1.3416 1.5427 2.0113 2.4410 1.9725 1.5110 1.6284 1.9410 1.6421 2.0953 2.0776 1.7655 2.1625 1.2779 1.4425 2.2896 2.3363 2.4634 1.1417 1.0551 1.1197 1.1083 1.0797 1.1122 1.0899 1.1961 1.3144 2.1141 1.0597 1.2259 1.2404 5.1694 1.2728 7.9169 7.1147 6.6671 8.6340 1.0627 1.0922 1.0369 1.0372 1.0974 1.0977 1.0991 1.0997 1.0314 1.0322 1.0864 1.1082 1.1072 1.0924 1.1045 1.0905 1.1075 1.0932 1.0955 1.0966
irintensity: 1.4702 3.3748 5.5403 3.7737 3.2414 16.9706 4.7024 0.7585 0.3576 2.2687 2.3576 1.4006 0.9775 1.1371 0.8172 1.4466 4.0365 2.3526 0.9216 3.2262 0.0096 3.9456 0.9742 1.2336 6.1628 1.3445 0.4971 8.7366 1.6685 7.3440 30.3720 2.9877 11.1307 12.9625 7.0823 75.1422 3.6820 12.3974 2.6046 7.3731 4.9268 0.2731 51.5925 5.2406 0.3548 12.0645 1.5066 11.9036 15.5817 22.0004 15.8215 25.2283 50.0439 34.2372 40.2348 75.9941 24.2812 0.8152 9.4732 22.4202 34.2817 3.7782 10.2663 5.8543 36.7486 23.3694 13.2467 2.8334 47.1883 4.9576 5.3761 9.1786 1.0673 9.8154 1.1589 4.3511 6.6671 4.3323 6.6504 17.5115 73.4159 30.4180 7.5511 18.6723 1.1062 0.2220 0.5100 26.9221 890.7421 1074.3744 83.0090 50.0204 113.8796 53.0326 75.2238 96.0726 5.0445 9.4130 8.0285 1.0621 5.5715 36.5805 0.7759 1.8387 2.7263 8.4550 30.5703 14.0608
temp: 298.150 k
press: 1.00000 atm
elementType: 6 6 6 6 6 6 6 1 6 1 1 6 1 6 1 6 6 1 5 7 6 1 1 1 6 1 1 1 6 1 1 1 6 1 1 1 1 1
symmnumber: 1
zpe: 847181.5 jmol-1
zpe.correction: 0.322674 hartree
zpe.thermalcorrener: 0.339916 hartree
zpe.thermalcorrenthalpy: 0.340860 hartree
zpe.thermalcorrgfe: 0.278667 hartree
zpe.sumelectzpe: -700.880486 hartree
zpe.sumelectthermal: -700.863245 hartree
zpe.sumelectthermalent: -700.862301 hartree
zpe.sumelectthermalfe: -700.924494 hartree
dipole: -3.0499 10.4423 0.2621
dipole: 10.8818
quadrupole: -123.2403 -35.7212 -101.5297
quadrupole: 2.1624 -7.9705 25.7188
quadrupole: -36.4099 51.1092 -14.6993 2.1624 -7.9705 25.7188
hfenergy: -701.2031607 hartree
pointgroup: C01 [X(C16H20B1N1)]
dipole: -1.1999422 4.108331 0.1031307 debye
polarizability: 165.2209528|-39.1431982|327.3724424|-4.1528948|-0.8518955|269.6804706 unknown
InChI: InChI=1/C16H20BN/c1-17(2)13-9-5-7-11-12-8-6-10-14(18(3)4)16(12)15(11)13/h5-10,17-18H,1-4H3
charge 0 multiplicity 1
38 atoms
C  1.82748585 2.46879558 -0.22934495
C  1.91272261 2.53809539 -1.63500624
C  1.58390535 4.02086097 -1.58016215
C  1.49571375 3.91745149 -0.16717695
C  1.37967049 5.20875334 -2.21875395
C  1.19324458 4.98020897 0.61553533
C  1.07198387 6.32552042 -1.38935157
H  1.44053237 5.32729248 -3.2936756
C  0.97707376 6.22898343 -0.01681966
H  0.90247819 7.29020382 -1.85344883
H  0.73608078 7.11161196 0.56505016
C  2.2181804 1.42550007 -2.37343046
H  2.29784116 1.41225484 -3.45386247
C  2.43077952 0.25427622 -1.60647347
H  2.67271719 -0.66683712 -2.12753843
C  2.34772291 0.23195576 -0.21717592
C  2.03858057 1.37552879 0.57114952
H  2.53027475 -0.71300606 0.28720034
B  2.01669887 1.50396578 2.19303274
N  1.09297149 4.78711882 2.06751628
C  3.43607901 2.16678815 2.68525892
H  3.70984562 3.08261886 2.14008989
H  3.43350065 2.4102796 3.75688099
H  4.26458961 1.46430843 2.52213743
C  1.68676104 0.10945962 2.96158837
H  2.46890977 -0.64172081 2.77799763
H  1.63728814 0.24375999 4.05006454
H  0.73547395 -0.34081546 2.6489406
C  2.1242583 5.54105954 2.82991095
H  1.9234405 6.6086522 2.7478587
H  2.08007032 5.22779182 3.87195433
H  3.10037734 5.30589522 2.41256658
C  -0.28084866 5.03600581 2.5828089
H  -0.30636763 4.76529998 3.63762523
H  -0.532103 6.08804588 2.45511662
H  -0.97216372 4.41089642 2.02124519
H  1.25932126 3.75194792 2.23006436
H  1.07315828 2.31425666 2.46215919
