program: Gaussian 16
title: NaphtPyrid_Me-H2
version: ES64L-G16RevC.01
method: RwB97XD
basis: GenECP
operation: Freq
keyword: #N
keyword: Geom=AllCheck
keyword: Guess=TCheck
keyword: SCRF=Check
keyword: GenChk
keyword: RwB97XD/GenECP
keyword: Freq
converged: YES YES YES YES
title: Mulliken charges:
elementType: C C C C C C H H H B N C C H H H H C H H H C H H H N
charge: -1.478897 0.277384 0.419714 -0.492405 -0.444334 0.397245 0.209825 0.256513 0.218993 -0.284162 0.217029 0.949313 -0.679418 0.282676 0.294122 0.306562 -0.127173 -0.523645 0.116317 0.145334 0.129295 -0.557526 0.107775 0.124240 0.144396 -0.009173
chargesum: -0.00000
title: Mulliken charges with hydrogens summed into heavy atoms:
elementType: C C C C C C B N C C C C N
charge: -1.478897 0.277384 0.629538 -0.235892 -0.225341 0.397245 -0.411335 0.523592 1.243435 -0.396742 -0.132699 -0.181115 -0.009173
chargesum: 0.00000
1716.lowfreq: -3.8237 -0.0004 -0.0001 0.0003 5.3447 10.8044 45.0799 93.0877 154.7522
frequency: 45.0069 93.0842 154.7505 171.6510 183.5915 211.6600 225.7833 241.8151 296.3097 346.1763 414.8967 437.2093 469.4818 476.2448 540.0897 572.2033 577.1356 670.9105 697.7587 750.1468 766.5405 780.6700 790.8105 815.3578 823.2581 867.2858 896.1737 915.0985 941.4119 969.6945 996.2052 1005.9374 1019.3222 1028.7058 1054.0388 1074.8959 1097.9570 1105.8130 1181.2008 1207.9567 1218.9029 1257.0761 1268.3078 1307.0576 1317.9716 1325.7330 1342.8714 1422.2076 1445.5440 1453.5184 1468.2128 1476.9142 1481.7050 1485.4288 1497.6937 1580.5578 1634.7758 1641.9237 1669.9376 2158.1526 2986.2506 2991.3296 3044.4898 3049.8820 3067.0309 3070.8599 3188.4094 3201.2224 3214.7697 3218.3008 3240.7958 3324.8638
redmass: 2.8761 3.3960 3.3663 3.7477 3.7803 1.1291 1.0429 2.3893 3.5670 2.7434 3.2304 4.2430 3.6891 3.4945 7.2663 4.4482 3.3366 5.0267 5.1129 1.2750 2.1439 1.9206 1.6446 1.7514 4.6871 3.4816 1.3176 1.5174 1.5916 1.7048 1.2289 3.0173 1.3901 1.3571 2.5151 2.2668 1.9393 1.8150 1.3328 1.4621 1.5989 2.5003 1.8604 1.2680 1.3197 2.3579 2.4300 2.5168 1.9033 5.3524 1.0546 1.0605 1.0559 1.0585 2.1602 2.8270 6.3814 4.4814 5.3012 1.0770 1.0373 1.0388 1.0984 1.0962 1.0991 1.0986 1.0881 1.0912 1.0921 1.0974 1.0964 1.0852
irintensity: 0.5326 1.0284 4.2404 2.2136 0.5357 2.6574 0.2513 5.0351 2.0042 7.5649 8.0310 0.4567 4.1701 2.6153 6.7869 5.6562 3.3545 2.9999 0.3966 5.6846 1.9392 18.7396 6.7763 9.6456 11.4583 5.5167 77.8501 2.3583 0.7986 1.9165 31.8260 19.7940 0.9904 2.1607 0.5057 3.7744 31.6968 33.2726 7.3742 168.7404 56.3051 11.5678 2.9952 31.5810 22.4907 17.5929 0.6280 66.3804 67.7978 113.3082 0.3913 0.9593 5.6612 1.0326 98.2768 51.3332 63.3402 1.9608 13.3252 396.8974 81.5507 57.3583 80.2889 84.5432 43.5071 114.7532 4.6802 12.5829 0.7685 9.8327 2.0530 537.9254
temp: 298.150 k
press: 1.00000 atm
elementType: 6 6 6 6 6 6 1 1 1 5 7 6 6 1 1 1 1 6 1 1 1 6 1 1 1 7
symmnumber: 1
zpe: 562047.1 jmol-1
zpe.correction: 0.214072 hartree
zpe.thermalcorrener: 0.225692 hartree
zpe.thermalcorrenthalpy: 0.226637 hartree
zpe.thermalcorrgfe: 0.176703 hartree
zpe.sumelectzpe: -522.941622 hartree
zpe.sumelectthermal: -522.930002 hartree
zpe.sumelectthermalent: -522.929057 hartree
zpe.sumelectthermalfe: -522.978991 hartree
dipole: -8.7928 5.2573 -1.5605
dipole: 10.3628
quadrupole: -82.2327 -75.8273 -83.4925
quadrupole: 4.8465 4.4468 -6.0502
quadrupole: -1.7152 4.6902 -2.9750 4.8465 4.4468 -6.0502
hfenergy: -523.1556939 hartree
pointgroup: C01 [X(C10H13B1N2)]
dipole: -3.4593676 2.0683717 -0.6139524 debye
dipolederiv: 0.4567808 0.5650355 -0.196343 -0.3677205 -0.2062035 0.1262454 0.0935434 0.0797711 0.1577421 -0.1739694 -0.3377257 0.1674666 -0.4503235 0.0800889 -0.1501853 0.2051281 -0.13933 -0.1028207 0.2127298 0.0155617 -0.0316637 0.3952436 -0.4130172 0.1308897 -0.1195468 0.0959112 -0.1559231 0.3235421 -0.1411815 0.0544411 -0.1249713 0.3469276 -0.1373173 0.0146153 -0.1136135 -0.0235076 -0.4711099 -0.0164166 -0.0192874 -0.3448382 -0.0524878 -0.0208624 0.1148273 -0.0414869 -0.187427 -0.4293534 -0.1624246 0.0788921 0.8634317 0.3226817 -0.0993732 -0.219937 -0.0708254 0.0948131 -0.0674594 -0.0501201 0.0234833 -0.0356735 0.1101146 0.0102122 0.0070247 0.0116447 0.1126267 0.0741947 -0.0591336 0.0217517 -0.0494626 -0.0608396 0.0644802 0.0184312 0.0591293 0.1215184 0.0107292 0.0889881 -0.0148334 0.0383596 0.0172659 0.0392438 -0.0013819 0.0376219 0.1533173 0.6144919 0.0283158 -0.031691 0.0159781 0.5281881 0.0618731 -0.0683143 0.1811057 0.4141152 -0.3691243 0.5902181 -0.1257165 0.3048041 -0.029461 -0.0042807 -0.0422536 -0.0044298 -0.0192198 0.0923208 0.0946036 -0.0405828 -0.2267949 0.3494382 -0.0941616 0.0558398 -0.1032381 0.0180724 0.2845421 0.1285428 -0.0607345 0.3105127 -0.3250068 0.0799495 -0.1086383 0.0603293 -0.0372263 0.0002199 -0.0076988 0.0113223 -0.0296313 0.1017675 0.0153348 0.0172167 0.0131489 0.1465774 0.0545297 0.0440836 -0.0080351 0.0784727 0.0512907 0.0172138 -0.0094984 0.0227109 0.13246 0.7180288 -0.2083649 0.0205007 -0.2053032 0.3737196 -0.026154 -0.0312982 -0.0134988 0.2256335 -0.4680427 -0.1130576 -0.0752486 -0.1560327 -0.4868586 -0.0800467 -0.0294035 -0.1159021 -0.1995139 -0.3631177 0.0508093 0.1840617 0.0365473 -0.0179425 0.0345128 0.1272074 -0.0002727 -0.073223 -0.0537216 -0.1194295 -0.0281676 -0.1989294 -0.1396302 -0.0539512 -0.0430987 -0.0678973 0.0286496 -0.0890417 0.1526778 -0.0346116 0.2041291 -0.1368513 0.0373122 -0.0588715 0.0574275 0.0562609 0.0631167 -0.0011491 -0.0203016 -0.0166028 0.0568216 0.0192017 0.0417338 -0.0035063 -0.2847333 -0.0704815 0.0794834 -0.079455 0.138104 -0.0855893 0.0416964 0.0142333 -0.0526198 -0.3364121 -0.1922173 -0.0174755 0.1969709 -0.0076732 0.0508033 -0.000806 0.141241 -0.0148663 -0.0477233 -0.0560527 0.1458016 -0.0972168 0.1544282 -0.1276544 0.122628 -0.1363056 0.1424234 -0.0208304 -0.0214613 -0.099323 -0.079221 -0.1465439 -0.1375805 -0.1326018 -0.0357317 -0.0550803 0.0040886 -0.0800738 -0.6506208 0.1842192 -0.1795101 -0.1699849 -0.0010535 0.0532372 0.0353434 -0.1773147 unknown
polarizability: 226.1734996|5.8694515|187.2435651|-6.1248285|-27.0936199|117.7611666 unknown
InChI: InChI=1/C10H13BN2/c1-11(2)9-5-3-4-8-6-7-12-13-10(8)9/h3-7,11,13H,1-2H3
charge 0 multiplicity 1
26 atoms
C  -0.14548224 0.0850766 -0.78883142
C  1.27278189 0.18182798 -0.88544223
C  1.70527137 1.42911934 -1.27977067
C  0.830603 2.51916537 -1.5394802
C  -0.52649565 2.40542587 -1.41367919
C  -1.05890885 1.15270136 -1.02863874
H  2.77144589 1.5970036 -1.3923039
H  1.25853727 3.46962943 -1.83969468
H  -1.19232374 3.23914272 -1.6003571
B  2.22159922 -1.07361887 -0.44900758
N  -0.67484354 -1.11089788 -0.44931374
C  -2.41303856 0.85992948 -0.86026117
C  -2.794602 -0.41832069 -0.48784335
H  -3.83163018 -0.68998902 -0.34428764
H  -3.16661968 1.62207048 -1.02237232
H  0.02053817 -1.86576508 -0.34385215
H  1.62891304 -2.12775946 -0.77593934
C  3.66718891 -1.03215312 -1.19330046
H  4.2628468 -0.15616737 -0.89638805
H  4.26695371 -1.9122091 -0.93082071
H  3.59159476 -1.0121882 -2.28862668
C  2.3637557 -1.04043031 1.18731982
H  1.40564472 -1.07532231 1.72642186
H  2.95680019 -1.89215533 1.54308087
H  2.87864406 -0.12931736 1.52271923
N  -1.92350427 -1.41013514 -0.29305645
