program: Gaussian 16
title: Me_Me-H2
version: ES64L-G16RevC.01
method: RwB97XD
basis: GenECP
operation: Freq
keyword: #N
keyword: Geom=AllCheck
keyword: Guess=TCheck
keyword: SCRF=Check
keyword: GenChk
keyword: RwB97XD/GenECP
keyword: Freq
converged: YES YES YES YES
title: Mulliken charges:
elementType: H C C C C H C H C H B C H H H C H H H N H H C H H H C H H H
charge: 0.221362 -0.325998 -0.196968 -0.484097 0.204692 0.199212 -0.181706 0.227528 -0.006945 0.193366 -0.302735 -0.378148 0.199505 0.208189 0.207948 -0.373486 0.197891 0.210366 0.235678 0.145404 -0.050527 0.260426 -0.560017 0.119965 0.130942 0.136750 -0.576533 0.117043 0.075013 0.145880
chargesum: -0.00000
title: Mulliken charges with hydrogens summed into heavy atoms:
elementType: C C C C C C B C C N C C
charge: -0.104636 0.002244 -0.256569 0.204692 0.011660 -0.006945 -0.353261 0.237494 0.270449 0.405830 -0.172360 -0.238597
1716.lowfreq: -14.5896 0.0001 0.0002 0.0005 10.1883 12.4227 47.2168 74.8248 96.5529
frequency: 46.8968 74.8191 96.5070 136.7702 170.2642 196.7781 203.6821 222.9573 228.5873 240.0940 260.6408 282.6193 330.4849 360.0649 430.4276 487.9043 512.2918 522.9745 575.4192 599.6793 688.0582 740.6336 759.7374 767.0183 788.4734 801.4712 818.5948 893.1142 917.4905 953.7638 960.9618 979.8230 1022.1360 1027.7560 1046.1404 1069.0716 1084.2742 1092.1421 1107.6497 1155.3502 1170.7527 1189.3773 1205.3813 1220.1019 1263.1090 1279.7704 1304.1925 1309.8331 1320.5328 1330.7912 1448.8403 1451.5243 1466.7001 1474.2172 1479.8494 1480.9923 1482.2927 1483.5839 1489.9018 1492.1588 1505.6952 1511.0866 1527.9668 1549.9118 1639.3913 1675.2333 2020.9945 2873.0151 2988.6876 2994.0128 3046.6182 3052.8519 3063.2976 3069.2381 3078.4601 3082.8000 3172.8821 3176.3123 3177.7010 3184.5735 3187.6472 3192.0243 3194.8394 3212.5579
redmass: 2.7402 2.6412 2.9782 3.0148 2.4371 1.1194 1.3437 1.3477 1.0782 1.3719 2.9475 2.3102 2.6365 3.2061 3.0269 3.0776 3.0923 2.7962 3.3937 3.6224 3.8541 1.2132 1.6760 2.8190 1.8944 2.4298 1.6603 1.3811 1.5327 2.7185 1.8736 1.4326 1.3271 2.4468 1.7982 2.2572 1.3268 2.0088 2.4736 1.8729 1.6415 1.1831 2.2617 1.5511 1.4574 1.7591 1.5304 1.3134 1.3764 3.3175 1.1734 1.3202 1.0526 1.0902 1.0896 1.1560 1.0626 1.0670 1.0964 1.8378 1.0647 1.2137 1.5931 1.1610 5.3153 5.7650 1.0699 1.0868 1.0366 1.0376 1.0981 1.0971 1.0996 1.0993 1.0316 1.0327 1.1076 1.1055 1.0868 1.0910 1.1058 1.1068 1.0939 1.0980
irintensity: 1.9445 0.3811 0.6572 2.7838 20.7126 0.2838 2.2562 1.0222 0.8285 4.3759 2.8056 0.3474 3.6169 0.9107 7.2095 4.3218 14.8052 6.2464 8.5555 0.6001 1.2749 15.3407 37.4860 1.9090 22.6165 0.2750 2.5317 2.4466 17.3706 18.5067 2.8105 1.5628 0.3317 30.9359 13.0991 11.8186 5.9930 25.1326 26.4780 8.4456 6.0023 0.5153 5.3814 45.2137 78.1793 55.9762 21.9998 40.9180 71.2959 5.9167 18.2211 81.2640 0.5356 6.1231 5.7489 11.7867 3.4668 5.8352 8.1318 5.6291 18.9913 9.1431 78.7654 5.2837 13.7827 6.3624 698.5439 1041.8613 85.8935 32.3855 89.9029 74.7651 72.7811 110.0415 8.2828 14.1311 2.1696 13.6795 5.7952 1.6753 2.0167 2.3398 32.9615 20.0766
temp: 298.150 k
press: 1.00000 atm
elementType: 1 6 6 6 6 1 6 1 6 1 5 6 1 1 1 6 1 1 1 7 1 1 6 1 1 1 6 1 1 1
symmnumber: 1
zpe: 694882.2 jmol-1
zpe.correction: 0.264667 hartree
zpe.thermalcorrener: 0.278020 hartree
zpe.thermalcorrenthalpy: 0.278964 hartree
zpe.thermalcorrgfe: 0.225601 hartree
zpe.sumelectzpe: -471.191829 hartree
zpe.sumelectthermal: -471.178476 hartree
zpe.sumelectthermalent: -471.177532 hartree
zpe.sumelectthermalfe: -471.230895 hartree
dipole: 3.5618 -8.7593 0.6880
dipole: 9.4808
quadrupole: -34.0838 -97.2673 -80.4881
quadrupole: -43.3923 3.6478 0.8565
quadrupole: 36.5292 -26.6542 -9.8750 -43.3923 3.6478 0.8565
hfenergy: -471.4564958 hartree
pointgroup: C01 [X(C10H18B1N1)]
dipole: 1.4013066 -3.4461742 0.2706916 debye
polarizability: 180.6542955|0.8252712|187.2936988|-5.3304217|-6.4441023|126.5544403 unknown
InChI: InChI=1/C10H18BN/c1-11(2)9-7-5-6-8-10(9)12(3)4/h5-8,11-12H,1-4H3
charge 0 multiplicity 1
30 atoms
H  0.44407586 0.40870198 0.23300147
C  1.52298159 0.30071313 0.19339852
C  2.32665436 1.42677793 0.07770168
C  2.09021502 -0.97088339 0.26087259
C  3.72771089 1.35068194 0.01962942
H  1.85783932 2.40468894 0.03004818
C  3.4698572 -1.09920297 0.21133985
H  1.46513708 -1.85145908 0.35163909
C  4.23395951 0.05464484 0.09235437
H  3.92917666 -2.08129115 0.26232804
B  4.68184255 2.66668771 -0.18467916
C  6.19025298 -0.62682477 -1.25308049
H  5.73406107 -0.07480333 -2.07202116
H  7.2752726 -0.53463425 -1.29596251
H  5.90022912 -1.67593933 -1.30483705
C  6.32023284 -0.68187727 1.21352416
H  6.03961643 -1.73351556 1.25468236
H  7.40383747 -0.59018781 1.14195465
H  5.95803835 -0.1656999 2.1006466
N  5.70664169 -0.04614576 0.02311563
H  5.84646411 2.39359558 0.24044333
H  5.96757044 0.9780124 0.04473171
C  4.15913205 3.94171527 0.68186362
H  3.18006637 4.30035046 0.33299137
H  4.05471698 3.72417193 1.7528307
H  4.84736001 4.79146802 0.59090523
C  4.80075675 3.00480297 -1.78259329
H  5.45252289 3.86956722 -1.96182546
H  5.19606619 2.17844441 -2.39060743
H  3.81622895 3.25363209 -2.20284573
