program: Gaussian 16
title: me_indenoPy_h2
version: ES64L-G16RevC.02
method: RwB97XD
basis: GenECP
operation: Freq
keyword: #N
keyword: Geom=AllCheck
keyword: Guess=TCheck
keyword: SCRF=Check
keyword: GenChk
keyword: RwB97XD/GenECP
keyword: Freq
converged: YES YES YES YES
title: Mulliken charges:
elementType: C C C C C C H H H C H H C C C C C H H H N B C H H H C H H H H H
charge: 0.225339 -0.108263 0.097895 0.173995 -0.343691 -0.366217 0.200770 0.227654 0.208990 -0.663463 0.225537 0.238211 -0.921922 0.166820 0.137202 0.541968 -0.656331 0.279557 0.275656 0.271536 0.284139 -0.506083 -0.565330 0.130846 0.166678 0.106363 -0.547441 0.125650 0.139373 0.129651 -0.175881 0.500794
chargesum: -0.00000
title: Mulliken charges with hydrogens summed into heavy atoms:
elementType: C C C C C C C C C C C C N B C C
charge: 0.225339 -0.108263 0.097895 0.374764 -0.116037 -0.157227 -0.199715 -0.921922 0.166820 0.416759 0.817623 -0.384795 0.784932 -0.681965 -0.161443 -0.152767
1716.lowfreq: -13.0387 -6.0902 -1.2888 0.0004 0.0004 0.0005 65.6174 86.7267 108.1055
frequency: 65.4880 86.7174 108.1030 147.4823 169.1140 213.9221 234.2951 242.2602 246.5389 254.0546 273.7732 324.1686 371.8058 418.1857 423.5713 475.4373 520.0497 542.2697 556.9015 566.0918 577.8596 645.8387 674.1042 728.5146 747.0045 766.3980 789.0755 792.2270 793.5991 808.0475 822.6876 861.9464 894.4904 906.9166 924.8515 939.8300 956.3564 974.3606 1000.9818 1016.3382 1020.8378 1035.7714 1044.5235 1075.3871 1088.2008 1104.7432 1134.9069 1176.0031 1187.4033 1205.1739 1215.7377 1216.1882 1236.9924 1254.2427 1286.5803 1301.7383 1308.7855 1317.9973 1353.9347 1382.3566 1415.9218 1449.1880 1461.2219 1470.9939 1478.9029 1482.9554 1488.7258 1499.8193 1511.1006 1574.0585 1640.4096 1653.9465 1686.9635 1704.8816 2103.3847 2986.8699 2991.0169 3045.9253 3049.9902 3061.6947 3063.5805 3066.5694 3107.1134 3149.5605 3176.6566 3193.9024 3203.5682 3207.3167 3237.2297 3255.6387
redmass: 3.4014 3.3931 3.2816 3.0861 3.5444 1.2767 1.8783 1.6909 2.3540 1.6411 3.4365 3.7943 2.8574 4.3519 3.5364 2.9889 3.5026 3.9034 3.1922 4.7194 3.3413 6.2058 4.9571 2.9601 2.2229 1.4729 2.4026 1.5608 1.8294 1.6033 1.6477 4.4394 1.6763 2.6313 1.5547 1.3786 1.5854 1.9533 1.4629 1.3642 1.3517 2.1779 5.9096 2.2188 1.8715 1.8988 1.7394 1.1403 1.4340 1.3920 1.5048 1.5278 1.9868 2.2754 3.1577 1.8920 1.3177 1.2923 3.2514 1.8943 2.7785 1.1368 3.3545 1.0523 1.0609 1.0846 1.0671 2.2701 2.6146 2.8264 5.8977 6.4605 5.0842 5.7401 1.0724 1.0367 1.0372 1.0976 1.0978 1.1000 1.0991 1.0610 1.1026 1.0891 1.0866 1.0913 1.0967 1.0924 1.0920 1.0991
irintensity: 0.3300 2.6123 0.3962 9.7212 8.4174 5.9052 4.3946 6.3733 6.4878 1.3910 1.0198 0.5235 3.6403 10.1262 4.1531 0.9850 2.2500 0.6471 0.6171 0.6971 3.3483 5.6178 0.1627 2.0836 6.0764 13.3518 33.3148 68.9206 27.2175 1.6550 6.5117 10.4342 1.0713 21.8480 8.7619 9.5441 8.2200 7.5029 21.0296 0.7506 0.4234 15.8092 0.9881 32.4826 63.9934 8.7445 5.7420 0.0680 4.9626 45.1322 79.5993 32.3213 41.3151 45.8895 117.9012 10.7587 41.6196 35.4013 21.1687 107.1213 30.7133 11.9448 18.9123 1.1506 1.7376 5.4794 2.6989 10.2940 33.8055 104.7592 76.8389 110.7123 111.0149 286.5581 551.3445 84.5725 71.2711 92.1579 78.1329 25.6369 129.9238 8.1820 2.4112 845.1901 2.9620 19.0062 39.4951 4.3709 0.3922 0.1951
temp: 298.150 k
press: 1.00000 atm
elementType: 6 6 6 6 6 6 1 1 1 6 1 1 6 6 6 6 6 1 1 1 7 5 6 1 1 1 6 1 1 1 1 1
symmnumber: 1
zpe: 701180.8 jmol-1
zpe.correction: 0.267066 hartree
zpe.thermalcorrener: 0.280694 hartree
zpe.thermalcorrenthalpy: 0.281638 hartree
zpe.thermalcorrgfe: 0.227691 hartree
zpe.sumelectzpe: -622.405508 hartree
zpe.sumelectthermal: -622.391880 hartree
zpe.sumelectthermalent: -622.390936 hartree
zpe.sumelectthermalfe: -622.444883 hartree
dipole: -2.8880 -9.5254 -6.0180
dipole: 11.6314
quadrupole: -106.2318 -89.5973 -110.4165
quadrupole: -37.7556 -15.8205 -4.5556
quadrupole: -4.1500 12.4846 -8.3346 -37.7556 -15.8205 -4.5556
hfenergy: -622.6725739 hartree
pointgroup: C01 [X(C14H16B1N1)]
dipole: -1.136223 -3.7475733 -2.3676751 debye
polarizability: 221.060356|-35.8687149|285.2644897|40.3513487|38.6348185|170.0989616 unknown
InChI: InChI=1/C14H16BN/c1-15(2)12-7-3-5-10-9-11-6-4-8-16-14(11)13(10)12/h3-8,15-16H,9H2,1-2H3
charge 0 multiplicity 1
32 atoms
C  0.69890597 0.65178739 -0.43409393
C  1.93125735 0.67007954 0.24735046
C  2.44818645 1.77375694 0.95111088
C  1.62124378 2.90476082 0.8881601
C  0.40098039 2.91594561 0.21282448
C  -0.08433039 1.7892056 -0.45401502
H  1.93971722 3.81196757 1.39092128
H  -0.19181264 3.8255056 0.20849334
H  -1.03908979 1.81293379 -0.96746323
C  0.43833116 -0.70152529 -1.05860751
H  0.31978895 -0.64078122 -2.14451635
H  -0.46520335 -1.1701811 -0.65714744
C  2.51168176 -0.63663251 0.06399534
C  1.67346346 -1.47793914 -0.68546689
C  4.12049827 -2.333433 0.24536081
C  2.07870532 -2.76293165 -0.94968674
C  3.3286036 -3.19696058 -0.46672864
H  5.09424474 -2.59664418 0.63356756
H  1.45602342 -3.44039422 -1.52322623
H  3.6782027 -4.2025493 -0.65520526
N  3.69642382 -1.0764228 0.49758216
B  3.81725286 1.70190802 1.84061143
C  3.50456202 0.82906699 3.20197096
H  4.4121853 0.6890241 3.80380089
H  2.78323458 1.36419845 3.83418389
H  3.07561295 -0.16940858 3.03133638
C  4.4172648 3.1700591 2.20901401
H  3.74633564 3.73657784 2.87121101
H  5.37220511 3.08260146 2.74270784
H  4.6009407 3.79804561 1.32685163
H  4.6968723 1.10932484 1.16088188
H  4.28223205 -0.36332072 0.97546053
