program: Gaussian 16
title: Me_Me-H2
version: ES64L-G16RevC.01
method: RwB97XD
basis: GenECP
operation: Freq
keyword: #N
keyword: Geom=AllCheck
keyword: Guess=TCheck
keyword: SCRF=Check
keyword: GenChk
keyword: RwB97XD/GenECP
keyword: Freq
converged: YES YES YES YES
title: Mulliken charges:
elementType: C C C C C C C C H H H N H B C H H H C H H H C H H H C H H H H H
charge: -0.482705 0.626091 -0.739592 -0.700487 0.562241 -0.610233 -0.333927 0.627408 0.195144 0.215698 0.224884 0.136127 0.256091 -0.096598 -0.411403 0.261759 0.233077 0.166029 -0.538195 0.078708 0.144970 0.117388 -0.581628 0.116881 0.105796 0.117649 -0.554141 0.169405 0.205698 0.166334 0.434613 -0.113084
chargesum: -0.00000
title: Mulliken charges with hydrogens summed into heavy atoms:
elementType: C C C C C C C C N B C C C C
charge: -0.482705 0.882182 -0.739592 -0.505343 0.562241 -0.394535 -0.109042 0.627408 0.570740 -0.209682 0.249462 -0.197128 -0.241302 -0.012703
chargesum: 0.00000
1716.lowfreq: -5.9306 -3.1074 0.0004 0.0005 0.0006 21.3382 50.7801 61.2398 68.8098
frequency: 50.5504 61.2312 68.6522 122.4292 137.9171 149.9487 193.7126 222.0025 228.0048 234.8680 259.7668 301.7822 320.5595 326.6692 377.0178 383.6898 427.8101 463.4776 523.8707 551.0109 587.7846 623.1661 661.1128 745.9709 751.4682 760.6215 772.4394 787.4386 810.1262 840.2688 846.6929 879.4771 902.8823 920.1154 942.1257 950.0670 974.9155 994.7269 1025.6787 1031.1735 1058.4755 1067.9109 1115.9051 1141.1065 1151.9339 1160.1844 1166.9358 1183.3471 1205.2805 1254.9510 1271.3009 1293.5801 1308.2438 1317.1876 1322.2554 1364.9830 1397.1401 1421.8916 1451.9653 1468.9479 1469.8703 1473.8219 1481.7169 1485.1772 1491.7305 1492.7617 1503.4845 1514.5932 1548.4617 1645.4246 1682.9541 1701.2647 2234.1726 2989.2705 2993.5002 3047.0881 3048.9837 3053.4866 3065.1935 3068.1175 3087.8174 3114.9312 3138.4893 3187.6125 3188.4209 3192.7373 3204.4380 3212.1307 3245.3144 3483.3415
redmass: 3.3956 1.0488 2.5946 3.0410 2.9003 3.1993 1.0587 1.5445 2.8658 1.5888 2.5520 1.6090 1.7008 3.4268 2.7684 3.2452 3.1907 3.2969 3.0506 3.3913 3.6662 3.4968 4.0252 4.5612 1.8315 1.4564 3.2811 2.8894 1.4494 3.5725 1.3328 1.4342 1.3954 1.6654 2.8754 1.9739 2.8621 1.3465 1.4452 1.8408 2.7938 1.5529 1.6161 2.1778 1.5447 1.5894 1.3437 1.4139 1.4449 1.8854 1.7072 4.9656 1.2784 1.2560 1.5082 4.1899 1.3061 1.2542 1.2589 1.0873 1.6170 1.0619 1.0502 1.0518 1.0513 1.0563 1.4301 1.0400 3.2100 7.7071 7.4179 7.3765 1.0802 1.0379 1.0365 1.0385 1.0972 1.0980 1.0994 1.0990 1.0311 1.0988 1.1031 1.0898 1.1055 1.0950 1.1081 1.0952 1.0960 1.0745
irintensity: 0.8897 0.4503 2.0141 3.4307 2.0949 1.7552 0.3389 1.4291 0.7008 3.7152 6.9297 4.9804 1.7141 2.2002 5.3236 1.2131 4.3964 11.3293 10.9131 4.5466 5.1930 11.6204 6.8798 0.5154 3.4810 5.3291 0.8663 5.0570 1.7904 2.2676 9.2282 68.2009 0.6516 13.9443 10.6123 7.5924 21.7565 0.9855 2.8200 2.8569 5.9076 14.7884 62.1553 4.2132 20.6763 112.6740 8.9454 11.4652 27.3950 15.5169 23.2830 9.4166 30.0956 8.2819 11.5381 1.2559 11.9622 0.5822 4.7925 0.1407 1.2589 3.6659 3.1134 3.0800 6.7379 15.5261 36.1014 26.4596 68.3846 18.9697 56.5617 3.6121 425.9968 76.8388 82.4712 36.6296 67.5724 101.6368 45.2323 136.9189 16.1595 16.4494 16.4852 13.2861 1.7707 8.5418 0.6207 9.9629 4.7056 75.5146
temp: 298.150 k
press: 1.00000 atm
elementType: 6 6 6 6 6 6 6 6 1 1 1 7 1 5 6 1 1 1 6 1 1 1 6 1 1 1 6 1 1 1 1 1
symmnumber: 1
zpe: 726031.9 jmol-1
zpe.correction: 0.276531 hartree
zpe.thermalcorrener: 0.291043 hartree
zpe.thermalcorrenthalpy: 0.291987 hartree
zpe.thermalcorrgfe: 0.235675 hartree
zpe.sumelectzpe: -547.371426 hartree
zpe.sumelectthermal: -547.356914 hartree
zpe.sumelectthermalent: -547.355969 hartree
zpe.sumelectthermalfe: -547.412281 hartree
dipole: -2.6511 9.8922 0.3205
dipole: 10.2464
quadrupole: -75.3740 -100.3373 -92.3095
quadrupole: -3.0420 1.6928 -0.6686
quadrupole: 13.9663 -10.9971 -2.9692 -3.0420 1.6928 -0.6686
hfenergy: -547.6479565 hartree
pointgroup: C01 [X(C12H18B1N1)]
dipole: -1.0430317 3.8919106 0.1261111 debye
polarizability: 208.9488867|-35.3960127|242.3604123|15.7079735|-5.758105|134.5676192 unknown
InChI: InChI=1/C12H18BN/c1-9-5-6-10-8-12(13(2)3)14(4)11(10)7-9/h5-8,13-14H,1-4H3
charge 0 multiplicity 1
32 atoms
C  -1.14611 -1.35301022 -0.05290481
C  -2.47798557 -1.28677022 -0.19530156
C  -1.85046183 0.92918848 -0.14244211
C  -1.91340174 2.30412237 -0.15910474
C  -3.17355235 2.89476533 -0.30253977
C  -4.29606476 2.06709371 -0.4102787
C  -4.205942 0.67830624 -0.38749041
C  -2.95278669 0.09336619 -0.24999091
H  -1.02415902 2.91904582 -0.06723222
H  -5.27313135 2.52813457 -0.51356427
H  -5.09730414 0.067974 -0.47223577
N  -0.66213783 0.08794 0.00747308
H  -3.1091032 -2.15964226 -0.28428704
B  -0.02296986 -2.51787101 -0.01841306
C  0.12752122 0.37360076 1.23975595
H  -0.51977606 0.19572106 2.0961504
H  0.97593102 -0.30571447 1.25604628
H  0.45874872 1.41052947 1.21624333
C  0.20152132 -3.07070898 1.51096943
H  0.51009441 -2.31379172 2.24424625
H  -0.71804607 -3.52868866 1.90206017
H  0.97341024 -3.85073932 1.52379688
C  -0.48307355 -3.72807223 -1.01368947
H  -1.42184141 -4.19663467 -0.68274772
H  -0.63655826 -3.40371926 -2.05126949
H  0.27028844 -4.5257878 -1.03423586
C  -3.31171521 4.3932686 -0.36825568
H  -2.50788638 4.89159944 0.17742744
H  -3.27336869 4.74014532 -1.40554711
H  -4.26385057 4.72059322 0.05380223
H  -0.03683671 0.1949739 -0.79456525
H  1.01586918 -1.97596205 -0.43836988
