program: Gaussian 16
title: Quinoline_Me_6NHMe-H2
version: ES64L-G16RevC.01
method: RwB97XD
basis: GenECP
operation: Freq
keyword: #N
keyword: Geom=AllCheck
keyword: Guess=TCheck
keyword: SCRF=Check
keyword: GenChk
keyword: RwB97XD/GenECP
keyword: Freq
converged: YES YES NO YES
title: Mulliken charges:
elementType: C C C C C H C H C C H H H N B C H H H C H H H C N H C H H H H H
charge: 0.336462 0.329615 -1.960858 1.251396 -0.805420 0.199031 0.414369 0.194046 -0.729001 0.020948 0.244892 0.266457 0.284169 0.238253 -0.192015 -0.591053 0.142754 0.113625 0.101737 -0.571790 0.147104 0.115148 0.119465 -0.056375 -0.230470 0.323934 -0.439172 0.183861 0.195598 0.189812 -0.123168 0.286647
chargesum: -0.00000
title: Mulliken charges with hydrogens summed into heavy atoms:
elementType: C C C C C C C C N B C C C N C
charge: 0.535493 0.329615 -1.960858 1.251396 -0.611374 0.659261 -0.462544 0.305117 0.524900 -0.315183 -0.232937 -0.190073 -0.056375 0.093464 0.130099
chargesum: 0.00000
1716.lowfreq: -7.7897 0.0002 0.0006 0.0006 9.0870 15.0478 46.7635 57.1930 96.0582
frequency: 46.5815 57.0156 95.9759 116.9861 138.3902 179.3429 193.0212 210.7864 214.9512 238.8912 250.7829 272.1189 306.2103 326.9970 349.9391 395.1868 430.4108 436.7516 497.1790 543.7985 553.0875 601.9561 611.3281 647.2732 655.9379 743.9893 762.2906 770.9939 776.7554 794.3836 812.4813 834.9294 864.6391 906.3726 922.4178 926.4644 946.8234 971.3687 998.7465 1004.0361 1016.0938 1051.1846 1083.9021 1097.4818 1106.6202 1153.9620 1172.5862 1179.1681 1199.8871 1226.0128 1247.6768 1265.2678 1305.6029 1308.7071 1319.7807 1349.2788 1385.1645 1430.3841 1448.5597 1462.8328 1467.3788 1478.8645 1482.6131 1487.2096 1487.6874 1493.7208 1503.7368 1523.3200 1555.6566 1595.6206 1648.3172 1659.5777 1684.3440 2129.6633 2984.1127 2988.4075 3024.4943 3041.8626 3046.1498 3062.4198 3067.2101 3087.3748 3149.6707 3188.1875 3196.8560 3203.9379 3233.8354 3251.9115 3333.1715 3687.9281
redmass: 2.6986 3.1928 3.1689 3.8087 3.0738 3.0767 2.0542 1.4691 1.1562 1.0735 2.3659 2.2511 3.0066 1.7778 2.2991 3.4844 3.5812 3.7559 3.2101 3.9804 4.2648 4.0658 3.6710 5.4520 2.4498 1.4279 2.0007 2.9740 3.2375 1.3795 1.5413 1.6224 2.6796 1.6436 2.1880 1.4224 2.3167 2.1064 2.7039 1.3807 1.2647 2.1736 2.1900 1.9256 1.7642 1.2826 1.3871 1.5955 1.4671 1.8573 1.3703 1.5040 1.4164 2.4140 1.2716 1.7329 2.2222 3.8331 2.5778 2.0518 1.0562 1.1006 1.0921 1.0544 1.6818 1.0810 2.0037 1.1394 2.0620 2.5786 6.4755 5.1381 5.2058 1.0762 1.0370 1.0389 1.0403 1.0981 1.0958 1.0992 1.0986 1.1013 1.0996 1.0915 1.0911 1.0890 1.0930 1.0981 1.0830 1.0775
irintensity: 3.6603 18.6761 0.8618 3.2389 5.3156 3.0606 8.6403 12.8294 1.7102 0.6731 1.1095 15.7735 31.0221 47.8483 26.1975 14.1770 12.2340 3.2544 3.6095 3.5765 4.1107 0.3150 8.9998 4.5691 0.7516 2.3477 2.7459 14.1304 8.2895 14.8387 3.7202 89.4635 6.8785 6.0978 7.4074 15.1015 16.1731 7.3228 10.3379 15.0392 3.7262 8.9398 21.0827 6.4939 61.2104 3.1388 0.7415 26.2820 180.1943 21.3784 23.7539 14.8197 110.4949 167.4358 12.2114 59.7782 5.8904 2.1463 92.6308 260.6346 2.6795 3.6172 20.5230 2.0404 62.6915 12.5312 56.0464 34.5778 272.9898 6.1900 190.6310 433.2972 23.7534 439.5648 83.0333 61.2710 94.5464 85.1603 83.0969 57.1177 115.3738 34.0879 25.0747 15.4793 5.8430 9.0835 4.1692 0.4537 560.3859 68.2982
temp: 298.150 k
press: 1.00000 atm
elementType: 6 6 6 6 6 1 6 1 6 6 1 1 1 7 5 6 1 1 1 6 1 1 1 6 7 1 6 1 1 1 1 1
symmnumber: 1
zpe: 711556.7 jmol-1
zpe.correction: 0.271018 hartree
zpe.thermalcorrener: 0.285867 hartree
zpe.thermalcorrenthalpy: 0.286811 hartree
zpe.thermalcorrgfe: 0.229769 hartree
zpe.sumelectzpe: -601.549900 hartree
zpe.sumelectthermal: -601.535051 hartree
zpe.sumelectthermalent: -601.534107 hartree
zpe.sumelectthermalfe: -601.591149 hartree
dipole: -1.8705 9.6785 -0.1984
dipole: 9.8596
quadrupole: -53.6358 -80.6893 -101.5558
quadrupole: -14.5313 0.3794 0.0082
quadrupole: 24.9912 -2.0623 -22.9289 -14.5313 0.3794 0.0082
hfenergy: -601.8209175 hartree
pointgroup: C01 [X(C12H17B1N2)]
dipole: -0.7358987 3.8078277 -0.0780724 debye
polarizability: 281.1308777|35.876812|244.3857333|2.4667356|5.8220209|128.2476479 unknown
InChI: InChI=1/C12H17BN2/c1-13(2)11-8-10(14-3)7-9-5-4-6-15-12(9)11/h4-8,13-15H,1-3H3
charge 0 multiplicity 1
32 atoms
C  -4.00562309 -0.06890944 -0.0900901
C  -2.63227761 -0.045591 -0.11934706
C  -2.06005144 1.25495579 -0.04610983
C  -2.82144478 2.44660966 0.08303961
C  -4.22089901 2.34776491 0.11995875
H  -4.49764085 -1.0330052 -0.15056332
C  -2.10950824 3.66489461 0.16687448
H  -4.8186764 3.24715775 0.22251219
C  -0.73370867 3.69269461 0.11599588
C  -0.03266278 2.49730979 -0.03481602
H  -2.66367927 4.59183444 0.27204758
H  -0.18646446 4.62311302 0.18038451
H  1.044621 2.43963351 -0.104258
N  -0.70495444 1.35980278 -0.10668469
B  -1.67461745 -1.37044815 -0.12688741
C  -1.22580794 -1.67535542 1.42414638
H  -2.09794949 -1.92680288 2.04408951
H  -0.53951124 -2.53049236 1.47586848
H  -0.72253122 -0.83380567 1.92274349
C  -2.4012006 -2.65497199 -0.81444283
H  -1.71930175 -3.51297978 -0.86602288
H  -3.2751145 -2.99429655 -0.23790301
H  -2.74889149 -2.46055925 -1.83797934
C  -4.82309624 1.0996705 0.02700052
N  -6.1846049 0.98178421 0.06902697
H  -6.71466455 1.8348752 0.03177533
C  -6.90335236 -0.25024211 -0.17349946
H  -6.6807802 -0.99953884 0.59169306
H  -7.97130188 -0.03836808 -0.13166028
H  -6.67525017 -0.67893635 -1.15621546
H  -0.64487237 -1.09314407 -0.79033903
H  -0.24464902 0.45190455 -0.26301456
