program: Gaussian 16
title: MeQHBMe2-H2
version: ES64L-G16RevC.01
method: RwB97XD
basis: GenECP
operation: Freq
keyword: #N
keyword: Geom=AllCheck
keyword: Guess=TCheck
keyword: SCRF=Check
keyword: GenChk
keyword: RwB97XD/GenECP
keyword: Freq
converged: YES YES NO NO
title: Mulliken charges:
elementType: C C H C N N N B H H H H H C H H H C H H H
charge: -0.417029 -0.422310 0.277466 0.037049 0.311008 -0.152615 -0.116181 -0.069577 0.445259 0.211960 0.211000 0.224649 -0.161366 -0.544202 0.111622 0.124638 0.114991 -0.543902 0.114003 0.126445 0.117092
chargesum: 0.00000
title: Mulliken charges with hydrogens summed into heavy atoms:
elementType: C C C N N N B C C
charge: 0.230580 -0.144844 0.037049 0.311008 -0.152615 0.329078 -0.230944 -0.192951 -0.186362
1716.lowfreq: -0.0004 -0.0002 0.0004 7.8783 8.6430 13.0785 32.0100 54.8168 89.6507
frequency: 24.7043 54.6828 89.6023 125.9068 201.3082 225.6452 229.2870 250.3288 359.9538 392.1520 412.5481 535.6879 684.7268 708.1965 722.9559 756.0098 775.2788 785.5863 806.6770 836.6424 907.5363 949.9182 1018.4439 1046.8561 1081.4007 1093.3900 1124.9244 1135.5581 1158.6075 1174.5765 1241.1081 1306.3014 1313.2900 1316.0863 1403.9739 1452.3697 1456.6652 1468.0922 1473.8324 1479.3604 1484.4838 1486.2896 1488.1762 1520.2104 1599.2693 2286.3536 2985.6738 2987.4794 3045.1481 3047.6144 3066.8498 3068.0772 3088.5627 3178.6228 3202.1775 3303.9639 3651.4098
redmass: 3.1406 1.0683 3.0069 2.6702 1.0326 1.2411 2.2454 2.5427 2.5828 4.5697 2.9364 2.4657 3.9471 3.9601 3.6122 1.1468 2.3994 1.1437 1.4416 1.4659 1.4529 1.9524 2.0628 3.1350 1.9273 2.6977 1.6240 1.6489 1.3442 1.7589 2.1512 1.3260 2.2605 1.7118 3.7707 2.1860 1.5125 1.0536 1.0520 1.0719 1.0799 1.4137 1.4155 1.4690 3.4774 1.0824 1.0389 1.0382 1.0974 1.0962 1.0991 1.0986 1.0323 1.1072 1.1066 1.1012 1.0837
irintensity: 0.0707 0.0243 0.1836 1.8712 0.0165 0.4028 0.8620 3.7037 0.8620 5.3595 11.9153 4.0063 7.3791 3.6875 5.2343 4.4020 1.2388 95.7447 0.2045 23.1704 10.1449 0.8997 7.9159 22.4375 4.2230 67.9487 62.9722 31.4399 0.9306 72.7986 101.5479 29.5420 6.8922 8.0568 40.4840 11.8484 5.6559 0.0303 1.9898 2.6789 3.7216 24.6499 20.7109 4.9038 39.0839 419.3700 75.3316 64.2070 58.0264 123.2054 32.5740 129.8745 12.0587 2.3205 0.1370 5.1843 146.3302
temp: 298.150 k
press: 1.00000 atm
elementType: 6 6 1 6 7 7 7 5 1 1 1 1 1 6 1 1 1 6 1 1 1
symmnumber: 1
zpe: 466965.5 jmol-1
zpe.correction: 0.177858 hartree
zpe.thermalcorrener: 0.188232 hartree
zpe.thermalcorrenthalpy: 0.189176 hartree
zpe.thermalcorrgfe: 0.141030 hartree
zpe.sumelectzpe: -386.621750 hartree
zpe.sumelectthermal: -386.611375 hartree
zpe.sumelectthermalent: -386.610431 hartree
zpe.sumelectthermalfe: -386.658577 hartree
dipole: 7.9008 5.1526 -2.5964
dipole: 9.7834
quadrupole: -70.9869 -77.2322 -63.5707
quadrupole: -20.3152 12.2990 5.8533
quadrupole: -0.3903 -6.6356 7.0259 -20.3152 12.2990 5.8533
hfenergy: -386.7996075 hartree
pointgroup: C01 [X(C5H12B1N3)]
dipole: 3.1084316 2.0272036 -1.0215167 debye
dipolederiv: 0.5697261 0.1427451 -0.0225732 0.1127077 0.1958031 0.030738 -0.0282449 0.0278649 0.1632391 -0.1590653 -0.3909084 0.3217518 0.0454368 -0.1733929 0.0772711 -0.0542228 -0.0213555 -0.0869949 0.0974035 0.0058704 -0.0257497 0.0077413 0.1494619 0.0428227 -0.0277012 0.0432514 0.1550378 0.3000992 0.5027905 -0.3627572 0.1661371 0.0578122 -0.0824162 -0.0833142 -0.0149581 -0.0598762 -0.4484025 -0.1289053 0.0135475 0.0207532 0.2772815 -0.2562056 -0.0777274 -0.287868 0.1691618 0.1780629 -0.1264078 0.1743794 -0.1879416 -0.5991784 0.4176413 0.1971942 0.4202096 -0.3555815 -0.4575329 0.0816486 -0.153462 -0.0657713 0.1333238 -0.2431912 -0.0132986 -0.1964517 0.0340854 0.6225004 -0.020331 0.0517413 -0.0360439 0.5344629 -0.0004796 0.1013404 0.0275273 0.5215781 0.3424922 -0.0163154 0.025701 -0.0437261 0.2995342 -0.0104353 0.0456194 -0.0019663 0.3125066 -0.0052234 -0.0237638 0.0115798 0.057847 -0.0159704 -0.033987 0.023237 -0.0234011 0.1099691 0.0463783 0.0194056 -0.0447392 -0.0404696 0.0623732 0.0514092 0.0188022 0.0688585 0.0542719 -0.0019112 -0.0312581 0.032458 -0.0500943 0.0863544 -0.0311702 -0.035748 -0.0570557 -0.0200345 -0.4704357 0.0620994 -0.1514974 0.1060445 -0.2797658 0.1093668 -0.1948317 0.0914886 -0.3456009 -0.0836023 0.006375 0.0773355 0.0412929 -0.3689322 -0.0856334 0.0516452 -0.0294878 0.0031387 -0.1689531 0.1309101 -0.1335356 0.0767119 0.010747 0.0303089 -0.1407797 0.073983 -0.02997 -0.1019003 -0.1765009 0.0633457 -0.1679278 -0.1077845 0.0660039 0.0689574 0.0762973 0.0380427 0.045827 0.0333506 0.0598706 0.022409 0.0278684 -0.0735849 0.0588031 -0.1344006 -0.2564437 -0.0680438 -0.0708175 0.1096217 -0.075311 -0.0488959 -0.0235803 0.0735941 -0.1098102 -0.3360658 0.0460887 0.0627264 0.0200013 0.084474 -0.253959 -0.1308812 0.0085535 -0.0711813 0.0245196 -0.1394364 -0.1317354 0.128655 -0.1379177 -0.0231234 0.0894361 0.1331673 0.0891192 -0.0193614 -0.1440712 0.069022 -0.1956741 0.0636479 0.0359797 0.0565668 -0.1250451 0.0293363 -0.0756219 unknown
polarizability: 123.2080892|12.2324376|112.2740099|-3.7153471|-15.7118913|102.6398495 unknown
InChI: InChI=1/C5H12BN3/c1-6(2)5-4-9(3)8-7-5/h4,6-7H,1-3H3
charge 0 multiplicity 1
21 atoms
C  1.59267213 0.03754417 -0.0475444
C  -0.2928842 -1.44753919 0.73918948
H  0.33172664 -2.05407693 1.37220986
C  -1.6526458 -1.50120936 0.48558255
N  0.21224937 -0.42445902 0.00711157
N  -0.70196881 0.18479607 -0.69561701
N  -1.79838916 -0.47621848 -0.39179564
B  -2.87870263 -2.42705817 1.00454161
H  -2.67012624 -0.19768242 -0.82163934
H  2.23940196 -0.80376809 -0.2909606
H  1.66030847 0.7983337 -0.82083861
H  1.86992867 0.45804914 0.91817615
H  -3.85264335 -2.06497609 0.33301302
C  -2.52054359 -3.99718711 0.72819589
H  -1.62953544 -4.32309994 1.28601693
H  -3.34472622 -4.64336151 1.05519303
H  -2.3376724 -4.22588865 -0.33012653
C  -3.12342665 -2.12209524 2.59346437
H  -3.34655509 -1.06868997 2.80943195
H  -3.96954144 -2.7099203 2.97103616
H  -2.25172435 -2.39773389 3.20568617
