program: Gaussian 16
title: me_naphthalene_h2
version: ES64L-G16RevC.02
method: RwB97XD
basis: GenECP
operation: Freq
keyword: #N
keyword: Geom=AllCheck
keyword: Guess=TCheck
keyword: SCRF=Check
keyword: GenChk
keyword: RwB97XD/GenECP
keyword: Freq
converged: YES YES YES YES
title: Mulliken charges:
elementType: C C C C C C H C C H H C C H H H B C H H H C H H H N C H H H C H H H H H
charge: -0.295484 0.071892 -0.005496 0.358954 -0.271713 -0.438851 0.179027 0.035979 -0.257859 0.186876 0.242987 -0.471610 -0.044233 0.197118 0.226684 0.185006 -0.487516 -0.576242 0.155562 0.132696 0.141276 -0.523860 0.172847 0.138256 0.085857 0.044429 -0.439891 0.224211 0.219009 0.242108 -0.343219 0.238400 0.186230 0.224862 0.255491 0.010217
chargesum: -0.00000
title: Mulliken charges with hydrogens summed into heavy atoms:
elementType: C C C C C C C C C C B C C N C C
charge: -0.116458 0.071892 -0.005496 0.358954 -0.084837 -0.195864 0.035979 -0.060741 -0.244926 0.140773 -0.477299 -0.146708 -0.126900 0.299920 0.245437 0.306273
1716.lowfreq: -8.6674 -3.4388 0.0005 0.0006 0.0006 10.9770 36.2763 100.7400 106.9298
frequency: 36.2442 100.7301 106.8877 125.1248 161.7419 171.5285 186.2746 201.5051 226.9161 246.5854 257.6893 263.9835 289.9732 305.2938 313.4788 364.5920 385.2461 433.8253 475.6678 485.6816 510.1703 530.0516 532.1371 549.9068 626.0261 651.7678 677.5306 734.7878 760.5444 775.4539 792.3309 799.2222 805.0628 823.4258 853.0269 894.5565 908.4049 926.2553 942.7740 953.3987 987.7038 1005.5442 1016.4369 1035.3318 1048.3006 1061.5980 1074.4231 1088.5762 1116.8371 1121.7055 1176.2571 1182.4940 1199.0329 1208.1215 1231.1373 1247.9246 1255.7508 1294.9798 1312.1578 1320.6636 1336.7156 1367.0616 1392.3687 1406.1141 1447.6864 1463.5397 1466.6971 1467.9815 1481.2303 1481.6342 1486.2308 1488.1568 1493.4708 1496.0861 1506.1719 1510.9941 1511.7566 1546.1776 1579.9943 1643.3905 1663.0911 1701.9967 2098.9826 2616.6036 2995.8657 2999.6421 3057.9655 3059.5054 3068.3146 3070.7260 3076.9556 3084.8139 3171.9183 3174.9109 3178.2954 3185.6997 3187.0747 3196.2671 3199.4568 3202.7187 3208.5909 3218.4243
redmass: 3.6771 2.6166 2.4160 2.8496 3.2601 2.0972 2.2605 1.5972 1.5960 1.5641 2.1031 1.2049 1.3379 2.5044 2.8313 3.3756 2.8590 2.9892 3.6797 3.3713 4.2016 3.6770 3.3078 5.8586 3.3028 3.1866 3.1376 2.1284 1.7181 1.4646 1.8339 1.6544 4.4651 1.5057 2.6401 4.0706 1.4343 1.4517 1.5717 2.4700 2.1223 1.3379 1.3469 2.8578 2.1596 2.8578 1.7879 1.3025 2.4227 1.9058 1.4048 1.4036 1.7398 1.5261 1.8131 1.7272 1.9341 2.0917 1.2856 1.2592 1.4545 1.9202 2.7663 3.9720 1.1404 1.1576 1.6480 1.0955 1.0631 1.1453 1.1245 1.2018 1.0665 1.6796 1.1142 1.0873 1.0802 2.2706 1.6724 6.5990 5.3389 5.3147 1.0665 1.0977 1.0368 1.0362 1.0987 1.0976 1.0995 1.0993 1.0315 1.0335 1.1069 1.1071 1.0861 1.1075 1.0885 1.0937 1.0997 1.0971 1.0940 1.0979
irintensity: 1.8498 1.5325 0.1776 3.7115 7.1259 13.0605 3.7769 1.2979 1.2025 0.5369 3.0926 4.2402 1.2282 0.8988 4.3123 7.4716 6.7845 2.8462 2.1802 0.8722 3.7101 3.1312 1.9041 1.9679 3.1676 0.7354 5.8284 4.4931 0.5189 2.6577 4.0475 73.6366 0.7784 18.1104 27.9237 7.5895 7.1170 2.5461 3.4161 25.5404 7.7014 0.4542 0.9661 26.2954 16.4367 8.8678 38.7070 10.9117 33.1516 28.0789 10.6106 0.3889 3.6223 3.0249 1.9786 1.9895 2.0387 2.0223 30.9036 13.0479 88.9765 126.6823 18.0663 26.9884 6.7600 25.8684 3.8415 0.3594 2.0935 7.3173 4.7237 7.8486 10.3033 0.6194 5.9059 22.9969 73.5438 19.7433 18.2905 13.4055 1.6325 2.5654 679.3574 1620.0469 72.9986 39.4165 72.8804 80.2834 31.3136 127.4615 9.9940 13.1183 4.0576 7.1879 4.0150 1.8277 2.5610 21.7373 3.3793 15.8273 31.4617 14.2646
temp: 298.150 k
press: 1.00000 atm
elementType: 6 6 6 6 6 6 1 6 6 1 1 6 6 1 1 1 5 6 1 1 1 6 1 1 1 7 6 1 1 1 6 1 1 1 1 1
symmnumber: 1
zpe: 820411.3 jmol-1
zpe.correction: 0.312478 hartree
zpe.thermalcorrener: 0.327985 hartree
zpe.thermalcorrenthalpy: 0.328929 hartree
zpe.thermalcorrgfe: 0.271173 hartree
zpe.sumelectzpe: -624.757003 hartree
zpe.sumelectthermal: -624.741496 hartree
zpe.sumelectthermalent: -624.740551 hartree
zpe.sumelectthermalfe: -624.798308 hartree
dipole: -7.4684 -2.1863 4.5367
dipole: 9.0077
quadrupole: -60.1692 -83.8726 -100.0547
quadrupole: 19.5107 -15.1434 -11.7477
quadrupole: 21.1963 -2.5071 -18.6892 19.5107 -15.1434 -11.7477
hfenergy: -625.0694807 hartree
pointgroup: C01 [X(C14H20B1N1)]
dipole: -2.9382906 -0.8601689 1.7848751 debye
polarizability: 266.7224944|2.4216341|247.2877094|-28.7860571|-13.2940723|156.0511592 unknown
InChI: InChI=1/C14H20BN/c1-15(2)12-9-5-7-11-8-6-10-13(14(11)12)16(3)4/h5-10,15-16H,1-4H3
charge 0 multiplicity 1
36 atoms
C  -5.38593528 -0.39107399 0.76146346
C  -4.05676098 -0.6435964 0.55968128
C  -3.11603469 0.3476918 0.14650555
C  -3.64935278 1.67220058 0.04215883
C  -5.0307041 1.91643277 0.2472237
C  -5.89139679 0.90880083 0.57844275
H  -6.05449953 -1.18033777 1.08518245
C  -1.72477226 0.0841481 -0.14910842
C  -2.78652555 2.75155693 -0.26670619
H  -5.39521314 2.93269429 0.13794769
H  -6.94662801 1.10236099 0.72823909
C  -1.45596599 2.51778238 -0.45682772
C  -0.95230439 1.20084345 -0.40604429
H  -3.20086357 3.7514915 -0.34103855
H  -0.78231882 3.3396274 -0.67688489
H  0.10152331 1.06252863 -0.61781783
B  -1.04169143 -1.39469801 -0.43657908
C  0.58021007 -1.36146765 -0.5703334
H  0.97146018 -2.38049136 -0.68089194
H  0.91608921 -0.80612092 -1.45706886
H  1.08372222 -0.91988917 0.29967763
C  -1.72197155 -2.01117383 -1.80060853
H  -1.39084078 -1.42009594 -2.66442495
H  -1.4117075 -3.04789247 -1.98470189
H  -2.82002649 -1.98899229 -1.83577014
N  -3.55522843 -1.97976211 0.91158891
C  -3.39317057 -2.12421742 2.38303293
H  -4.3697176 -2.0827504 2.86386018
H  -2.90661872 -3.07881559 2.58446021
H  -2.76412784 -1.30875627 2.73604928
C  -4.30292638 -3.11703818 0.32237465
H  -3.69286136 -4.01334234 0.43206853
H  -5.25068548 -3.25435095 0.84156363
H  -4.47599628 -2.9167239 -0.73166317
H  -2.54936087 -2.03852871 0.55068835
H  -1.22695215 -2.18598619 0.52918585
