program: Gaussian 16
title: Napht_Me-H2
version: ES64L-G16RevC.01
method: RwB97XD
basis: GenECP
operation: Freq
keyword: #N
keyword: Geom=AllCheck
keyword: Guess=TCheck
keyword: SCRF=Check
keyword: GenChk
keyword: RwB97XD/GenECP
keyword: Freq
converged: YES YES YES YES
title: Mulliken charges:
elementType: C C C C C C H H H B N C C H C H H H H C H H H C H H H
charge: -1.306595 0.137552 0.161040 -0.436802 -0.375514 0.361890 0.201887 0.242534 0.211765 -0.276296 0.216537 0.917044 -0.884359 0.265180 0.146043 0.290974 0.276803 0.302609 -0.140380 -0.519552 0.119072 0.145355 0.128732 -0.553564 0.103049 0.120443 0.144552
chargesum: -0.00000
title: Mulliken charges with hydrogens summed into heavy atoms:
elementType: C C C C C C B N C C C C C
charge: -1.306595 0.137552 0.362927 -0.194268 -0.163748 0.361890 -0.416676 0.519147 1.193847 -0.619179 0.437016 -0.126393 -0.185520
1716.lowfreq: -6.7265 -0.0003 -0.0003 0.0004 6.3575 10.2884 47.2446 95.1764 157.3967
frequency: 47.1573 95.1577 157.3929 171.5389 185.7050 213.0273 226.2709 242.0201 299.3338 349.2997 424.4407 441.3991 470.1726 478.8697 542.5292 566.3989 575.0850 638.7499 675.3866 747.0238 764.5498 775.9477 787.7253 813.7732 824.3124 837.6706 857.5213 908.7906 934.4704 948.1608 968.5072 997.8969 1016.9939 1023.7360 1027.7209 1049.9239 1075.7122 1093.1198 1104.8533 1168.5031 1184.6284 1212.1266 1236.8602 1253.4484 1265.3127 1305.4708 1316.2294 1322.2291 1377.4771 1435.7279 1441.2672 1467.7916 1475.1141 1480.2680 1483.3127 1485.0628 1517.3586 1592.7058 1651.2570 1655.4476 1699.2982 2120.0822 2983.8439 2990.0196 3041.9072 3048.3408 3062.3775 3067.5120 3183.2089 3195.9814 3200.1265 3211.5066 3235.1436 3248.1130 3297.6226
redmass: 2.8804 3.2475 3.0230 3.7419 3.4702 1.1479 1.0420 2.3045 3.3591 2.6929 3.3555 4.1363 3.2356 3.2953 6.4358 4.6994 3.3265 3.2397 4.8299 1.2857 1.9706 1.2150 2.6574 1.5805 4.6782 1.6270 3.4633 1.4330 1.4941 1.4149 1.8758 3.0467 1.3625 1.3520 1.2519 2.2612 2.4609 1.9940 1.7992 1.2986 1.4168 1.3646 1.4077 2.0589 1.6660 1.2715 1.2969 1.8738 2.5346 2.0561 6.1297 1.0545 1.1854 1.1186 1.6960 1.0575 2.3871 2.7806 5.4259 6.3324 5.5958 1.0755 1.0372 1.0385 1.0980 1.0963 1.0993 1.0990 1.0875 1.0905 1.0917 1.0978 1.0923 1.0992 1.0836
irintensity: 0.8667 1.0454 9.6112 5.2832 3.8617 4.1407 0.2615 4.5503 2.6418 10.8864 9.1798 0.9409 0.9317 6.0296 2.7623 3.6906 6.3481 4.4317 1.7074 3.8158 0.8816 1.8317 24.6299 13.5008 4.5627 99.2060 2.4874 10.5118 1.2886 9.5345 5.5208 13.0792 3.1917 7.5506 10.4068 5.6931 6.7109 15.8485 56.0922 10.5468 27.4888 192.3679 14.9804 5.7804 1.2542 29.6787 30.7267 0.7590 16.0340 62.1824 164.9775 0.5315 6.7195 3.2103 18.9638 1.3170 18.9192 110.7811 4.6291 12.5544 99.2929 441.4467 84.5080 60.3772 87.8480 80.8018 59.3220 110.5702 4.5721 13.5251 4.0650 20.5446 0.8703 0.4996 644.9159
temp: 298.150 k
press: 1.00000 atm
elementType: 6 6 6 6 6 6 1 1 1 5 7 6 6 1 6 1 1 1 1 6 1 1 1 6 1 1 1
symmnumber: 1
zpe: 593772.6 jmol-1
zpe.correction: 0.226156 hartree
zpe.thermalcorrener: 0.237843 hartree
zpe.thermalcorrenthalpy: 0.238787 hartree
zpe.thermalcorrgfe: 0.188852 hartree
zpe.sumelectzpe: -506.927691 hartree
zpe.sumelectthermal: -506.916004 hartree
zpe.sumelectthermalent: -506.915060 hartree
zpe.sumelectthermalfe: -506.964995 hartree
dipole: -10.4393 2.0110 -0.6885
dipole: 10.6535
quadrupole: -82.5865 -71.5276 -86.3427
quadrupole: 11.5305 3.9025 -5.3259
quadrupole: -2.4342 8.6247 -6.1904 11.5305 3.9025 -5.3259
hfenergy: -507.1538472 hartree
pointgroup: C01 [X(C11H14B1N1)]
dipole: -4.1071509 0.7911985 -0.2708736 debye
polarizability: 230.1926009|9.9387735|194.1726853|-6.9804535|-27.6188426|121.0859184 unknown
InChI: InChI=1/C11H14BN/c1-12(2)10-7-3-5-9-6-4-8-13-11(9)10/h3-8,12-13H,1-2H3
charge 0 multiplicity 1
27 atoms
C  -0.14083997 0.06575523 -0.78393671
C  1.27036917 0.17890961 -0.87769525
C  1.70307888 1.43142821 -1.26775466
C  0.82693977 2.51285548 -1.5296524
C  -0.53025702 2.3775467 -1.40740467
C  -1.0568408 1.12111954 -1.02524668
H  2.76987337 1.60231848 -1.3733124
H  1.24444272 3.46886637 -1.82702214
H  -1.20412901 3.20515466 -1.59653236
B  2.23279344 -1.06927159 -0.44350699
N  -0.65676953 -1.15188475 -0.43720248
C  -2.43191868 0.85714638 -0.86949235
C  -2.8787508 -0.39310456 -0.50011935
H  -3.93130517 -0.60644658 -0.37735628
C  -1.94512957 -1.40723694 -0.29572628
H  -2.21817982 -2.41905895 -0.02756821
H  -3.14428057 1.65626655 -1.04662465
H  0.07317401 -1.87559711 -0.34510303
H  1.64612167 -2.13424905 -0.76351424
C  3.67232182 -1.02945275 -1.20113743
H  4.26625185 -0.14872439 -0.91472574
H  4.2793605 -1.90529253 -0.93996537
H  3.58610858 -1.01432782 -2.29580727
C  2.39160912 -1.03920029 1.19112346
H  1.43720855 -1.07248438 1.73744592
H  2.98917121 -1.88906487 1.54523309
H  2.90706798 -0.1263654 1.52130763
