program: Gaussian 16
title: me_xanthene_h2
version: ES64L-G16RevC.02
method: RwB97XD
basis: GenECP
operation: Freq
keyword: #N
keyword: Geom=AllCheck
keyword: Guess=TCheck
keyword: SCRF=Check
keyword: GenChk
keyword: RwB97XD/GenECP
keyword: Freq
converged: YES YES NO NO
title: Mulliken charges:
elementType: C C C C C C H H H C O C H H H C H H H C C C C C H C H H B N C H H H C H H H C H H H C H H H H H
charge: 0.326179 -0.173986 -0.624837 -0.323946 0.372085 -0.303071 0.179699 0.222067 0.159470 0.144829 -0.061375 -0.492821 0.158265 0.177449 0.198554 -0.789784 0.191800 0.183319 0.204973 -0.013719 -0.377827 0.461381 0.530547 -0.619806 0.208300 -0.778938 0.257093 0.191685 -0.295940 0.106066 -0.521531 0.129408 0.115011 0.139257 -0.586948 0.175783 0.132103 0.091134 -0.358112 0.238021 0.235257 0.255803 -0.408935 0.242165 0.208152 0.242956 -0.149377 0.402142
chargesum: -0.00000
title: Mulliken charges with hydrogens summed into heavy atoms:
elementType: C C C C C C C O C C C C C C C C B N C C C C
charge: 0.326179 0.005714 -0.402770 -0.164476 0.372085 -0.303071 0.144829 -0.061375 0.041448 -0.209693 -0.013719 -0.377827 0.669681 0.530547 -0.362713 -0.587253 -0.445317 0.508208 -0.137856 -0.187927 0.370969 0.284339
chargesum: 0.00000
1716.lowfreq: -23.7406 -16.7390 -4.6997 -0.0003 -0.0001 0.0002 24.5252 51.9672 71.5825
frequency: 11.4483 51.9142 71.3346 81.8092 106.5038 132.6840 153.1692 157.1305 171.2225 177.9764 208.6316 212.0266 232.6865 242.1643 251.2975 273.1093 290.2486 291.7270 303.7836 306.3488 317.8166 321.9475 342.2498 353.8880 385.9292 397.9913 421.0219 454.4427 466.7951 507.7205 528.0507 539.3785 556.2471 581.9641 588.3578 604.9304 621.0241 653.7446 681.3089 702.6585 737.1540 765.4411 766.3588 781.3246 800.9799 809.1854 818.3661 824.6582 855.3409 864.4982 897.4743 911.1812 925.3603 933.6106 947.8666 963.8799 967.3915 999.6616 1002.9177 1004.5615 1024.9552 1031.8683 1043.0068 1081.7584 1091.4360 1099.2614 1101.7545 1144.2335 1163.5221 1174.8784 1177.8726 1189.0450 1193.6331 1196.1418 1203.3849 1224.3752 1238.7511 1276.9973 1283.1812 1294.3668 1296.7629 1299.7320 1312.4062 1322.3473 1334.7321 1352.5995 1404.7255 1425.9461 1448.5944 1450.4700 1465.7068 1469.5329 1475.4117 1476.7556 1481.6270 1485.2828 1486.2108 1487.3754 1491.5173 1496.9278 1502.1403 1507.9903 1509.7941 1512.6373 1516.3349 1523.4930 1529.8917 1541.5100 1634.5348 1657.3714 1673.3016 1696.8779 2130.9016 2957.2574 2971.1008 2988.6993 3030.5397 3041.9314 3044.7250 3051.6846 3055.8178 3057.8807 3079.7826 3088.3646 3120.1535 3127.0281 3135.6925 3138.0499 3168.7095 3178.7111 3184.6072 3186.9557 3195.3148 3202.4739 3204.0760 3210.2255 3216.2403 3226.9633
redmass: 3.2541 3.9477 3.0621 3.2393 3.2365 3.0804 3.1253 3.1967 2.9534 3.0814 1.1409 1.2142 1.8962 2.3088 1.2036 1.4513 2.4998 2.1368 2.4307 1.7166 1.5086 2.0985 1.3926 3.2660 3.8021 4.1188 3.6133 4.0796 3.2805 3.0041 4.7810 3.6785 3.4960 3.8074 4.2688 4.2788 3.7375 4.0754 5.5343 3.4480 1.7657 1.4971 1.6397 1.5963 1.7174 3.1308 2.4494 3.1283 5.0697 3.2926 2.8832 1.8718 1.4841 1.4438 2.0705 2.1072 1.8563 2.0689 1.3404 1.3551 2.0036 1.3335 1.9548 1.2912 1.6467 1.9561 2.1802 2.0038 2.1262 1.9146 1.4836 2.1639 1.5889 1.5642 1.6182 2.5218 2.2340 1.8500 2.3013 2.5211 2.1210 1.3034 1.3357 3.2736 4.1356 5.5214 1.2393 1.2348 1.1448 2.5848 1.1719 1.0612 1.1410 1.0922 1.1106 1.0538 1.1014 1.1418 1.0849 1.1311 1.8281 1.0509 1.1411 1.2054 1.0776 1.4922 1.9025 2.1221 5.7841 7.7888 7.7832 7.3234 1.0724 1.0799 1.0430 1.0382 1.0947 1.0353 1.0978 1.0362 1.0981 1.0995 1.0317 1.0331 1.1029 1.1019 1.1028 1.1023 1.0862 1.1089 1.1077 1.0924 1.1075 1.1069 1.0880 1.0937 1.0921 1.0970
irintensity: 1.5397 1.9566 4.0291 16.5522 8.1144 2.7028 1.2589 6.9281 4.0886 1.4292 0.5695 2.4333 1.9604 2.1042 0.0553 1.7683 1.5260 1.0554 0.3297 0.3639 1.1780 2.8649 0.1081 1.6324 2.3864 3.7328 4.0304 7.2614 0.2910 4.0220 4.2127 3.3715 0.4550 0.0197 4.5142 6.0713 1.9235 3.7577 5.0883 1.8864 9.8354 6.7958 26.1421 70.2194 9.3305 6.3881 3.8410 11.9927 8.8963 2.7780 24.1674 9.1228 1.1454 0.7019 6.3194 21.2043 3.5890 28.5358 2.5023 1.2361 13.4924 0.4073 18.4993 2.8865 28.4137 18.2250 35.1435 56.2618 38.8520 31.1542 14.6762 28.1003 62.2011 3.1419 9.2372 165.9726 9.9510 6.6969 12.8125 44.8727 1.0276 23.0326 35.6479 73.8194 24.5780 18.2601 11.9298 9.1025 5.0459 202.9023 2.4621 2.5574 7.8134 5.1935 14.2194 1.1773 4.7202 2.6612 25.5127 11.4332 3.2853 22.6613 18.9107 8.7147 12.3750 1.4020 52.7750 162.2920 5.7337 0.1920 13.4143 15.2011 780.4321 863.4877 294.2611 29.2743 120.6620 36.8460 62.9064 28.4409 90.8821 87.5544 5.4745 8.0304 17.5062 47.7841 18.6944 27.3740 7.4973 0.3028 3.2153 36.6390 1.2842 1.2231 1.0082 26.3912 8.5982 6.7607
temp: 298.150 k
press: 1.00000 atm
elementType: 6 6 6 6 6 6 1 1 1 6 8 6 1 1 1 6 1 1 1 6 6 6 6 6 1 6 1 1 5 7 6 1 1 1 6 1 1 1 6 1 1 1 6 1 1 1 1 1
symmnumber: 1
zpe: 1087589.4 jmol-1
zpe.correction: 0.414241 hartree
zpe.thermalcorrener: 0.435570 hartree
zpe.thermalcorrenthalpy: 0.436514 hartree
zpe.thermalcorrgfe: 0.365468 hartree
zpe.sumelectzpe: -894.010174 hartree
zpe.sumelectthermal: -893.988845 hartree
zpe.sumelectthermalent: -893.987901 hartree
zpe.sumelectthermalfe: -894.058947 hartree
dipole: -8.1181 6.4360 -6.8817
dipole: 12.4372
quadrupole: -47.7487 -111.2680 -136.8029
quadrupole: -35.3668 31.1406 -13.4790
quadrupole: 50.8578 -12.6615 -38.1964 -35.3668 31.1406 -13.4790
hfenergy: -894.4244148 hartree
pointgroup: C01 [X(C19H26B1N1O1)]
dipole: -3.1939182 2.5321303 -2.7074549 debye
polarizability: 305.7771447|21.8158077|292.8631644|31.9966393|-45.2261362|253.9372053 unknown
InChI: InChI=1/C19H26BNO/c1-19(2)13-9-7-11-15(20(3)4)17(13)22-18-14(19)10-8-12-16(18)21(5)6/h7-12,20-21H,1-6H3
charge 0 multiplicity 1
48 atoms
C  -2.37299461 1.56132106 1.1316249
C  -1.01635986 1.26012449 1.31965121
C  -0.00510824 2.16300965 1.00220111
C  -0.30290853 3.402183 0.43909409
C  -1.63334381 3.77147287 0.25769132
C  -2.59138369 2.85574896 0.68112789
H  -0.7439317 0.27412298 1.68520924
H  1.03324601 1.88569589 1.15401355
H  0.502082 4.06153654 0.13699696
C  -2.1149647 5.06681636 -0.41573747
O  -3.93272987 3.23533593 0.52499124
C  -1.02449029 5.70776205 -1.27440058
H  -1.39113651 6.62610561 -1.7399141
H  -0.1680901 5.98604484 -0.65712329
H  -0.67920928 5.03000274 -2.05908032
C  -2.5585135 6.07438366 0.66955955
H  -1.70421257 6.3338403 1.30002426
H  -2.94276946 6.98834715 0.20700929
H  -3.33668289 5.65393249 1.30948062
C  -3.33853257 4.69091271 -1.25748552
C  -4.19294251 3.75499833 -0.68763837
C  -3.69026322 5.17048739 -2.51444667
C  -5.30794615 3.25997903 -1.34125942
C  -4.84522168 4.72271871 -3.15841088
H  -3.0632611 5.89956371 -3.01367579
C  -5.66382048 3.75517522 -2.58477042
H  -5.09977308 5.11930591 -4.13360514
H  -6.53568064 3.39073658 -3.11410747
B  -3.56928306 0.43436806 1.12131588
N  -6.01389943 2.18786121 -0.62402373
C  -3.37594906 -0.73116425 2.24347811
H  -4.18648414 -1.47133874 2.19876528
H  -2.44037063 -1.29209771 2.10210603
H  -3.35798692 -0.33747698 3.26827712
C  -3.56763455 -0.19522125 -0.40475479
H  -2.63109633 -0.73747695 -0.5928459
H  -4.38625444 -0.91226939 -0.56355705
H  -3.63170857 0.56342046 -1.20192584
C  -7.06328751 2.73014198 0.28841809
H  -7.82881887 3.221866 -0.31043195
H  -7.48622675 1.90186713 0.8551195
H  -6.59098481 3.43773642 0.96619814
C  -6.54981917 1.11613271 -1.50337486
H  -6.86271203 0.29000636 -0.86713552
H  -7.4006589 1.49707806 -2.06622005
H  -5.75924737 0.7851219 -2.17192424
H  -4.68161009 0.98441811 1.32964932
H  -5.30750279 1.73986497 0.01796543
