program: Gaussian 16
title: no2_benzopiperidine_h2
version: AS64L-G16RevC.02
method: RwB97XD
basis: GenECP
operation: Freq
keyword: #N
keyword: Geom=AllCheck
keyword: Guess=TCheck
keyword: SCRF=Check
keyword: GenChk
keyword: RwB97XD/GenECP
keyword: Freq
converged: YES YES NO NO
title: Mulliken charges:
elementType: H C C C C H C H H B H H C N C C C H H C H H C H H H H H H N N O O O O
charge: 0.245646 -0.238255 -0.039642 -0.592259 -0.250183 0.231038 -0.286906 0.243518 0.196194 0.085552 0.101535 0.139625 0.225926 0.205762 -0.287712 -0.043111 -0.307429 0.259838 0.251318 -0.481358 0.300293 0.203336 -0.598225 0.253910 0.213043 0.239125 0.236225 0.235865 0.160949 -0.480872 -0.578053 -0.022713 0.113936 0.065350 -0.001263
chargesum: -0.00000
title: Mulliken charges with hydrogens summed into heavy atoms:
elementType: C C C C C B C N C C C C C N N O O O O
charge: 0.007391 0.191396 -0.348742 -0.250183 -0.090711 0.187087 0.225926 0.345387 0.223443 0.460517 0.159524 -0.006008 -0.201411 -0.480872 -0.578053 -0.022713 0.113936 0.065350 -0.001263
1716.lowfreq: -16.2202 -13.9921 -0.0007 -0.0005 -0.0004 2.6515 19.5851 29.7918 60.3084
frequency: 18.8573 27.7431 60.1792 63.9962 84.0016 98.2318 116.2035 161.9252 181.9939 212.4458 225.3756 253.5849 262.5699 309.3484 316.5066 336.4760 374.2595 388.1962 457.0754 464.6999 487.8824 503.1719 522.0833 555.3142 598.1049 648.2144 665.4359 715.9464 766.1889 780.0530 792.4410 802.2960 821.2304 826.5750 855.8560 888.8535 896.1467 905.2402 923.2787 930.2459 949.9434 973.6511 989.6249 1030.9653 1037.3263 1057.9696 1067.4866 1070.4050 1087.4404 1108.8138 1115.0108 1156.4555 1169.0095 1183.8773 1200.0030 1208.5730 1239.5428 1243.7801 1294.3917 1309.1935 1315.7296 1337.2441 1348.0674 1364.8016 1399.8726 1402.4914 1405.3617 1413.2962 1421.4138 1462.4024 1485.3380 1491.8032 1493.1784 1494.9678 1498.1066 1501.5977 1511.3580 1523.1132 1571.3139 1585.3298 1633.9970 1648.6751 1690.3856 2528.8446 3043.5277 3055.1693 3064.2750 3088.2906 3096.8553 3116.0983 3119.8036 3123.8485 3160.7186 3163.0415 3183.6867 3198.5536 3209.3687 3221.3930 3231.8906
redmass: 10.3243 4.3682 5.5856 7.2950 3.9106 4.5298 8.3056 5.0955 6.0937 3.9782 6.1060 2.1831 4.9818 3.8605 6.7845 2.9294 10.0053 2.2959 4.3665 3.1256 3.7251 3.8167 1.9424 3.4577 6.3766 4.7513 5.0852 3.7217 3.4549 1.8009 3.1861 3.6991 1.4826 3.7415 3.4322 1.6189 1.5071 5.8437 2.4445 2.1780 5.4370 1.4342 1.3903 1.3369 2.7280 1.8806 2.1252 1.7785 2.1769 2.1528 1.8607 1.0995 1.4930 1.9676 1.1990 2.1483 2.7862 1.5254 1.2993 1.3553 2.2466 1.6819 1.3740 1.2899 1.4562 1.4640 1.4270 2.4574 1.4608 1.7531 1.8669 1.3308 1.9252 1.2282 1.5147 1.1020 1.1112 2.1311 1.6000 6.8475 9.9351 4.8693 4.7831 1.0877 1.0697 1.0659 1.0646 1.0642 1.0622 1.0956 1.0987 1.1007 1.1050 1.1071 1.0829 1.0871 1.0915 1.0968 1.0948
irintensity: 0.5236 0.6923 2.3710 1.0292 2.8704 0.8878 2.1340 5.4704 25.3924 3.0574 2.0537 2.6903 0.8526 2.5755 2.6919 4.0901 5.0621 0.7640 1.6039 2.0571 18.5233 17.8291 3.2298 10.6749 9.5100 1.3077 5.6845 68.1565 6.4782 38.1827 41.4409 11.3609 1.9896 10.0303 1.2470 15.0172 1.3530 6.4733 5.4279 7.1760 0.5712 5.9755 0.7060 0.0527 20.3053 4.2190 16.5756 20.1399 3.2011 3.7728 53.7577 10.7884 38.5364 3.4930 2.1773 53.9453 35.0823 2.9709 3.3488 9.8877 4.3796 10.9002 3.6172 0.5872 11.1755 8.0397 5.5484 168.5806 39.8590 72.0202 70.1038 16.8428 8.9342 10.0979 10.4475 29.3257 11.7670 26.2982 177.1311 348.7060 465.3065 8.0549 8.2328 117.4763 25.2674 15.5895 9.8887 25.8541 22.9572 31.5664 23.1227 29.1420 18.1299 61.7569 491.3754 0.8881 12.5622 5.7404 5.8838
temp: 298.150 k
press: 1.00000 atm
elementType: 1 6 6 6 6 1 6 1 1 5 1 1 6 7 6 6 6 1 1 6 1 1 6 1 1 1 1 1 1 7 7 8 8 8 8
symmnumber: 1
zpe: 750040.0 jmol-1
zpe.correction: 0.285675 hartree
zpe.thermalcorrener: 0.302498 hartree
zpe.thermalcorrenthalpy: 0.303443 hartree
zpe.thermalcorrgfe: 0.239188 hartree
zpe.sumelectzpe: -918.369495 hartree
zpe.sumelectthermal: -918.352672 hartree
zpe.sumelectthermalent: -918.351728 hartree
zpe.sumelectthermalfe: -918.415983 hartree
dipole: -12.8462 7.8779 0.1926
dipole: 15.0706
quadrupole: -114.3756 -115.4648 -119.1413
quadrupole: 14.6234 -9.2203 -5.6845
quadrupole: 1.9516 0.8624 -2.8141 14.6234 -9.2203 -5.6845
hfenergy: -918.6551705 hartree
pointgroup: C01 [X(C11H16B1N3O4)]
dipole: -5.0540788 3.0994144 0.075779 debye
polarizability: 229.4314475|4.3704471|214.9405071|-0.1686694|-1.4701164|151.1652767 unknown
InChI: InChI=1/C11H16BN3O4/c16-14(17)12(15(18)19)10-6-2-3-7-11(10)13-8-4-1-5-9-13/h2-3,6-7,12-13H,1,4-5,8-9H2
charge 0 multiplicity 1
35 atoms
H  2.94344838 3.55002374 -0.47116327
C  2.07830968 2.9084208 -0.35043494
C  2.25558777 1.55760151 -0.08188551
C  0.79950223 3.43932355 -0.45317466
C  1.17225587 0.68825693 0.0839503
H  3.26100519 1.17105523 0.02222999
C  -0.30117624 2.60580974 -0.31431903
H  0.65348359 4.49524887 -0.64678031
H  -1.29887129 3.01877997 -0.39815131
B  1.34412453 -0.87643228 0.43405056
H  0.53578654 -1.29478208 1.22251638
H  -0.92414453 -0.59144189 -0.13971133
C  -0.09593481 1.25554484 -0.07190254
N  -1.27250147 0.3676632 0.05488969
C  -1.84926854 0.38961829 1.44124404
C  -2.32928247 0.57111461 -0.99273153
C  -2.90983882 -0.68974181 1.58510323
H  -1.01687907 0.24426885 2.12898801
H  -2.25833597 1.39151412 1.59256295
C  -3.38241188 -0.52042331 -0.87526859
H  -1.82094343 0.55260295 -1.95629967
H  -2.76984258 1.55675482 -0.83919633
C  -3.99943555 -0.54791387 0.52275906
H  -3.32931333 -0.62264113 2.59105036
H  -2.43140356 -1.67232882 1.50417109
H  -4.14374184 -0.33781787 -1.63644653
H  -2.92380888 -1.48725442 -1.10727018
H  -4.71085055 -1.37196201 0.60291529
H  -4.56022839 0.37855235 0.69400387
N  1.08609043 -1.66917405 -0.93469127
N  2.73449529 -1.30365291 1.05777137
O  -0.11433092 -1.82186002 -1.22569986
O  1.96853227 -2.00648325 -1.68458876
O  3.11968619 -2.45061763 0.90391936
O  3.31852615 -0.50499803 1.78136106
