program: Gaussian 16
title: MeQHBN2O4-H2
version: ES64L-G16RevC.01
method: RwB97XD
basis: GenECP
operation: Freq
keyword: #N
keyword: Geom=AllCheck
keyword: Guess=TCheck
keyword: SCRF=Check
keyword: GenChk
keyword: RwB97XD/GenECP
keyword: Freq
converged: YES YES YES YES
title: Mulliken charges:
elementType: C C H C N N N B H H H H H N O O N O O
charge: -0.389659 -0.460361 0.293440 -0.026452 0.251520 0.108147 -0.342413 0.252518 0.448308 0.236709 0.229646 0.223972 0.110586 -0.428982 0.011638 -0.053858 -0.430889 -0.095405 0.061536
chargesum: -0.00000
title: Mulliken charges with hydrogens summed into heavy atoms:
elementType: C C C N N N B N O O N O O
charge: 0.300667 -0.166921 -0.026452 0.251520 0.108147 0.105895 0.363104 -0.428982 0.011638 -0.053858 -0.430889 -0.095405 0.061536
1716.lowfreq: -0.0004 -0.0002 0.0005 2.7490 16.1524 18.3398 22.8324 29.9179 52.2256
frequency: 16.2253 28.7508 52.0073 80.3100 93.7896 145.8328 170.7429 222.2453 269.2548 322.6554 343.0264 355.3030 410.9340 513.6599 589.1400 661.5757 696.5307 706.4907 731.7195 781.6870 804.1603 863.1187 891.7680 910.8785 928.6616 1042.0717 1083.4511 1088.6488 1097.0971 1115.6682 1159.9425 1190.7918 1228.0347 1355.8916 1399.7867 1445.2766 1455.6468 1466.6454 1485.8750 1487.8730 1493.8318 1519.0378 1596.1881 1610.9011 1632.9645 2604.7174 3093.6722 3186.8691 3208.3654 3314.7437 3553.7250
redmass: 1.6485 2.0393 10.5506 10.8011 6.3707 5.5165 10.3414 4.5537 7.1856 9.4898 6.9053 13.5684 3.2345 9.0246 7.0646 3.4533 7.3364 4.9813 5.7640 4.9969 3.0427 1.7202 1.1225 7.2446 5.0562 2.1346 1.5789 2.9841 1.5703 1.9518 1.3417 2.0213 1.5503 8.0185 3.8078 2.2721 2.5595 3.1378 1.0614 7.6157 3.5660 1.4769 13.7759 9.3076 5.5265 1.0899 1.0319 1.1073 1.1071 1.1030 1.0854
irintensity: 0.5743 1.1634 0.2231 0.4044 3.4057 2.3053 13.6471 6.9701 9.0039 9.8637 5.9393 2.9251 9.5423 19.1588 7.2739 9.6749 0.8085 14.4294 36.3337 39.7859 28.7288 10.6955 78.6898 10.3818 5.2850 4.6318 18.6723 151.3902 41.5598 10.3482 0.2168 209.7907 116.9977 4.7878 16.2586 37.6989 19.9848 111.7720 17.0013 68.2655 21.9128 10.0868 414.7502 410.0394 96.5875 67.3945 7.7103 1.0258 0.0284 15.5223 406.8858
temp: 298.150 k
press: 1.00000 atm
elementType: 6 6 1 6 7 7 7 5 1 1 1 1 1 7 8 8 7 8 8
symmnumber: 1
zpe: 343975.3 jmol-1
zpe.correction: 0.131013 hartree
zpe.thermalcorrener: 0.143106 hartree
zpe.thermalcorrenthalpy: 0.144050 hartree
zpe.thermalcorrgfe: 0.089318 hartree
zpe.sumelectzpe: -717.119673 hartree
zpe.sumelectthermal: -717.107580 hartree
zpe.sumelectthermalent: -717.106636 hartree
zpe.sumelectthermalfe: -717.161369 hartree
dipole: 9.5421 9.4174 -3.9988
dipole: 13.9903
quadrupole: -102.8219 -110.7102 -91.8356
quadrupole: -31.4441 11.6546 18.2206
quadrupole: -1.0327 -8.9210 9.9537 -31.4441 11.6546 18.2206
hfenergy: -717.2506867 hartree
pointgroup: C01 [X(C3H6B1N5O4)]
dipole: 3.7541502 3.705078 -1.5732619 debye
dipolederiv: 0.456742 0.2102078 0.0209201 0.2211558 0.3448733 -0.0074876 0.0209145 -0.0074979 0.1248181 -0.1351355 0.0524299 0.2479558 -0.1030336 -0.01652 0.1843895 -0.0838931 -0.0446183 0.0347076 0.1460602 -0.0289831 -0.0033429 -0.0242243 0.1710513 -0.0144773 -0.0005447 -0.028923 0.1577939 0.0320838 0.0085314 -0.2015203 0.1746096 0.0276466 -0.2285084 0.1088617 0.0443825 -0.2154256 -0.1536502 -0.1686903 -0.1513156 -0.2591999 -0.2117958 0.0306963 -0.3043676 -0.0542191 0.2390189 -0.1495754 0.0806963 0.3848008 0.1591074 0.0811607 0.0910422 0.4174184 0.1431073 -0.4217071 -0.2300834 -0.2628254 -0.3080571 -0.2908045 -0.3475749 -0.0991916 -0.2930576 -0.1166937 0.1376389 0.878047 0.1987885 0.0278965 0.2755779 0.6700312 -0.0337948 0.0336502 -0.0373842 0.7060848 0.5539389 0.1692076 -0.0082781 0.224386 0.4655514 0.0265829 0.0633715 0.0740999 0.361059 0.0180365 -0.0529496 -0.0209469 -0.0102831 0.0372166 0.0680445 -0.0638314 0.0383547 0.0432449 0.0723404 -0.0453693 -0.0116339 -0.0178583 0.0934583 -0.0511041 0.0529108 -0.0032928 0.0224558 0.0001801 0.041837 0.0224442 -0.0269136 -0.0163995 -0.0212911 0.0085565 -0.0327248 0.1160462 -0.2285481 0.0257583 0.0140722 -0.0031458 -0.1780686 -0.0076835 0.0352028 -0.0155564 -0.15881 0.3389278 0.4401011 0.4204818 0.5405674 1.7313269 0.2819567 0.395943 0.3424295 0.8602305 -0.3131684 -0.0833282 -0.1556861 -0.4149362 -1.3735974 -0.1183901 -0.0133403 0.220707 -0.5086381 -0.5550675 -0.4021165 -0.2894039 -0.2220911 -0.8830205 -0.0651541 -0.3586365 -0.518139 -0.9484778 1.4674504 0.2491629 -0.7779594 0.1230946 0.2170211 0.1706995 -0.8635533 0.1117902 1.1079043 -0.9413951 -0.2125927 0.257848 0.0553241 -0.4317198 -0.3110601 0.7296845 -0.0221677 -1.1246809 -1.2571836 -0.2198656 0.5317246 -0.4013323 -0.3806407 0.1047309 0.1147106 -0.0936542 -0.5332634 unknown
polarizability: 118.3145714|28.5380454|104.2473878|-11.1274539|6.2589782|111.2460028 unknown
InChI: InChI=1/C3H6BN5O4/c1-7-2-3(5-6-7)4(8(10)11)9(12)13/h2,4-5H,1H3
charge 0 multiplicity 1
19 atoms
C  1.46374524 0.37556142 0.1150879
C  -0.65251153 -0.64128259 1.04517795
H  -0.6100426 -0.12445171 1.98791718
C  -1.55478356 -1.55931336 0.56020635
N  0.28160139 -0.4789768 0.07837068
N  0.04068786 -1.21386817 -0.97407098
N  -1.05657547 -1.84970085 -0.66485909
B  -2.87585554 -2.173529 1.22953956
H  -1.48880134 -2.51849016 -1.30084368
H  2.13848851 0.01653259 0.89048863
H  1.94387227 0.3185556 -0.85813589
H  1.15460237 1.39794309 0.32396691
H  -3.63997255 -1.33239862 1.59780809
N  -2.4093265 -3.00903593 2.50002114
O  -2.60598129 -4.20690781 2.58176331
O  -1.82900299 -2.36610153 3.36733084
N  -3.6584969 -3.15220642 0.24660576
O  -3.1481559 -3.48795217 -0.82932848
O  -4.75970067 -3.5293595 0.579024
