program: Gaussian 16
title: no2_nmeimidazole_h2
version: AS64L-G16RevC.02
method: RwB97XD
basis: GenECP
operation: Freq
keyword: #N
keyword: Geom=AllCheck
keyword: Guess=TCheck
keyword: SCRF=Check
keyword: GenChk
keyword: RwB97XD/GenECP
keyword: Freq
converged: YES YES YES YES
title: Mulliken charges:
elementType: C C H C N N B H H H H H C H N N O O O O
charge: -0.398941 -0.399305 0.255163 -0.177509 0.047340 -0.180847 0.277534 0.400973 0.130061 0.231389 0.177009 0.229698 0.099193 0.301984 -0.385752 -0.478005 -0.080551 0.030208 -0.105500 0.025861
chargesum: -0.00000
title: Mulliken charges with hydrogens summed into heavy atoms:
elementType: C C C N N B C N N O O O O
charge: 0.239155 -0.144143 -0.177509 0.047340 0.220126 0.407595 0.401177 -0.385752 -0.478005 -0.080551 0.030208 -0.105500 0.025861
chargesum: 0.00000
1716.lowfreq: -6.9471 -0.0009 -0.0007 0.0004 9.1648 14.2909 27.0194 46.2299 77.5745
frequency: 26.8611 45.6069 77.5098 86.7201 113.2073 124.8490 177.4610 219.1599 256.6184 307.5244 336.2012 354.9576 398.9175 498.5135 590.1975 634.9608 646.8485 695.2552 729.8014 772.5083 785.6901 795.0110 848.1107 859.4362 907.1803 933.9283 1007.4466 1063.6296 1084.2445 1105.1186 1111.0189 1157.0477 1173.5025 1185.0400 1260.1401 1369.3340 1426.4072 1455.1489 1469.4314 1476.1479 1486.5362 1496.3762 1524.7578 1586.2564 1603.6567 1618.3738 1658.8963 2575.8578 3084.3338 3173.2407 3187.6273 3306.0329 3316.8713 3589.9975
redmass: 11.3026 3.0519 1.7164 3.2220 4.8206 5.8985 11.6692 4.4926 6.2460 5.7921 10.7691 13.7981 3.1301 8.7065 6.8338 2.9299 3.5199 4.6005 5.1592 1.3919 3.2367 2.1813 2.0659 1.4720 8.3970 4.7325 2.6105 3.6845 1.5878 1.4681 1.5373 1.3327 1.2993 1.5654 2.0006 4.6420 2.6893 8.8494 1.2849 3.4948 1.0391 13.5786 1.2008 12.6623 9.2546 6.9592 4.4954 1.0884 1.0325 1.1073 1.1065 1.1027 1.1024 1.0843
irintensity: 0.8859 1.4631 0.1308 0.9929 4.5838 1.1504 15.3701 8.0249 2.5375 13.0407 5.8668 0.7271 3.5321 20.8145 8.2141 28.3533 9.2113 1.0838 56.5691 60.9821 31.9113 75.4424 12.1799 18.8245 7.0461 2.3912 11.4938 9.0789 8.8544 49.5998 26.6451 0.4042 162.0718 85.6811 63.5294 25.0560 11.2514 116.5776 3.9796 44.4576 16.8467 32.2183 12.8658 292.7116 577.7793 156.1571 18.4694 85.7696 18.0340 3.0914 3.5964 26.6768 8.8515 286.5327
temp: 298.150 k
press: 1.00000 atm
elementType: 6 6 1 6 7 7 5 1 1 1 1 1 6 1 7 7 8 8 8 8
symmnumber: 1
zpe: 375480.9 jmol-1
zpe.correction: 0.143013 hartree
zpe.thermalcorrener: 0.155200 hartree
zpe.thermalcorrenthalpy: 0.156144 hartree
zpe.thermalcorrgfe: 0.102470 hartree
zpe.sumelectzpe: -701.106223 hartree
zpe.sumelectthermal: -701.094036 hartree
zpe.sumelectthermalent: -701.093092 hartree
zpe.sumelectthermalfe: -701.146766 hartree
dipole: 16.3733 -0.4049 2.3210
dipole: 16.5420
quadrupole: -62.4567 -81.3887 -76.5701
quadrupole: -2.9347 -2.7247 1.7164
quadrupole: 11.0151 -7.9168 -3.0983 -2.9347 -2.7247 1.7164
hfenergy: -701.249236 hartree
pointgroup: C01 [X(C4H7B1N4O4)]
dipole: 6.4417557 -0.1592967 0.9131546 debye
dipolederiv: 0.5657842 0.1153525 -0.2072189 0.1111178 0.2149055 -0.0253452 -0.2277265 -0.0298694 0.279699 0.015878 0.0941673 -0.144273 -0.1529523 -0.0565966 -0.0108108 0.163503 -0.0885868 -0.0217723 0.1634332 -0.0119117 0.0216622 -0.0014144 0.1655285 0.0235756 0.0390704 0.0390156 0.1358019 0.0018503 -0.0729924 0.0592645 0.0895212 -0.1355819 0.012533 -0.1925869 0.0554352 -0.0652525 -0.5061804 -0.2114033 0.3003365 -0.1839822 -0.1231453 0.0188197 0.3264454 0.0241 -0.2109426 -0.4774445 -0.1759669 0.2286277 -0.2231372 -0.2222466 0.0512478 0.3592294 0.0952704 -0.3635446 1.0020073 -0.0749087 0.0152881 -0.0293661 0.6941305 -0.1157083 0.1341063 -0.1537959 0.6120664 0.5130165 0.0757052 0.0084103 0.1244784 0.3272972 -0.0124447 -0.0922473 -0.0441836 0.3680087 -0.2375381 0.0397578 0.0469742 0.0210812 -0.1831486 -0.0352425 0.0233818 -0.0273527 -0.2145715 0.0192244 0.0097943 0.0521521 -0.0617267 -0.0467807 0.0089274 0.0463409 -0.0263156 0.0822544 -0.004943 0.0073454 0.0156775 0.06764 0.054876 0.0640997 -0.0584546 0.0781458 0.0336666 0.0171999 -0.0448177 -0.0271379 -0.0252237 0.0884591 -0.0476955 0.0539084 -0.0225689 -0.0349014 0.21806 0.2171316 -0.308424 0.3032307 0.1321379 -0.1065156 -0.4303573 -0.076613 0.3024017 0.1038129 0.0024662 0.0146499 -0.0073482 0.1789458 0.0255536 0.0374683 0.0195497 0.166981 0.988774 0.1685588 0.8393379 0.1759899 0.6486498 -0.2630574 0.9914111 -0.2231007 1.3144963 1.6402352 -0.312973 -0.6885627 -0.3391601 0.2390118 -0.1020464 -0.7522807 -0.0478251 0.8940061 -0.9892362 0.1515371 0.2028296 -0.0436678 -0.3575656 0.2042174 0.6911326 0.0545041 -0.9796664 -1.3422491 0.227514 0.4026087 0.4472613 -0.4081756 -0.0517253 -0.0685517 0.1108135 -0.4838949 -0.7888406 -0.0823617 -0.2653552 0.2193963 -0.6960193 0.5753241 -0.5447337 0.2132193 -1.0612827 -0.902844 -0.1219947 -0.5668473 -0.4917381 -0.514682 -0.2137068 -0.4990588 0.0501579 -0.7535533 unknown
polarizability: 146.0009021|-2.0181879|92.8950305|-2.20321|-18.2921729|108.8772677 unknown
InChI: InChI=1/C4H7BN4O4/c1-7-2-4(6-3-7)5(8(10)11)9(12)13/h2-3,5-6H,1H3
charge 0 multiplicity 1
20 atoms
C  3.94745131 0.36433561 -0.78145454
C  1.44561302 0.57293349 -0.53342729
H  1.34465265 1.21840545 -1.38744451
C  0.4942933 0.08025901 0.30950585
N  2.67281973 0.07904228 -0.1342306
N  1.19521359 -0.70431806 1.20687431
B  -1.08148225 0.30250524 0.47748012
H  0.72670948 -1.25595301 1.91807465
H  -1.35624885 0.96428961 1.43800937
H  4.15147269 1.43283751 -0.72612001
H  4.73661115 -0.18361788 -0.27065618
H  3.90199315 0.04900282 -1.82294302
C  2.49180187 -0.70181798 0.92447397
H  3.26118824 -1.24072131 1.45094419
N  -1.75356796 -1.12690343 0.70180917
N  -1.75023582 0.98508036 -0.78897807
O  -1.0950066 1.15533584 -1.81381889
O  -2.9074076 1.3499483 -0.68554489
O  -1.31216303 -1.77118378 1.65923675
O  -2.62989006 -1.55457607 -0.0172794
