program: Gaussian 16
title: no2_quinoline_h2
version: AS64L-G16RevC.02
method: RwB97XD
basis: GenECP
operation: Freq
keyword: #N
keyword: Geom=AllCheck
keyword: Guess=TCheck
keyword: SCRF=Check
keyword: GenChk
keyword: RwB97XD/GenECP
keyword: Freq
converged: YES YES YES YES
title: Mulliken charges:
elementType: C C C C C C H C H H C C H H H N B N N O O O O H H
charge: 0.125758 -0.334305 -1.374508 0.504822 -0.420032 -0.382739 0.239807 1.203634 0.213037 0.257923 -1.028937 0.316918 0.282456 0.272323 0.310451 0.166416 0.151640 -0.543509 -0.391440 -0.030212 0.055484 0.021656 -0.047178 0.121042 0.309491
chargesum: -0.00000
title: Mulliken charges with hydrogens summed into heavy atoms:
elementType: C C C C C C C C C N B N N O O O O
charge: 0.365565 -0.334305 -1.374508 0.504822 -0.206995 -0.124816 1.486090 -0.756614 0.627370 0.475907 0.272682 -0.543509 -0.391440 -0.030212 0.055484 0.021656 -0.047178
1716.lowfreq: -8.7599 -0.0006 -0.0003 0.0003 5.2043 11.9650 32.9465 48.1430 72.7385
frequency: 32.5932 48.1255 72.7114 113.5692 142.3431 169.9357 171.5654 193.5886 233.3606 259.3046 309.2974 376.7156 400.9052 428.0555 470.3501 471.0438 530.3411 539.3321 553.2816 600.1521 628.1324 657.4505 731.9292 759.3983 775.2158 779.0863 816.0907 825.7078 834.4077 871.9466 894.9511 908.6770 943.4104 970.0531 1005.8825 1024.3452 1027.5715 1030.7046 1083.6181 1103.4394 1108.6604 1166.0174 1174.1083 1203.6834 1251.7782 1261.0696 1294.3020 1348.5077 1400.0929 1424.2433 1449.2010 1459.2131 1494.2921 1508.9713 1530.4292 1582.7557 1616.4669 1637.3998 1662.4304 1666.3682 1721.1562 2546.8363 3202.2580 3204.2310 3218.1864 3235.3207 3240.8679 3252.7704 3307.5640
redmass: 13.0727 8.1339 7.7579 9.4779 6.1664 5.9427 5.5034 6.6803 11.0045 4.8652 11.6670 13.2724 3.9878 4.1433 3.2430 6.3733 5.5975 6.9875 5.1877 6.5330 3.3375 6.2045 4.5286 3.6585 2.1650 2.8874 2.7384 5.3936 1.6217 4.5240 1.5438 5.0952 4.7140 1.4284 1.4554 1.3602 1.9775 1.4842 2.0548 1.7896 2.1562 1.5033 1.3017 1.4106 2.1938 1.6369 1.6965 2.3899 2.1900 8.1712 13.4009 1.7951 12.3576 2.7847 2.5204 13.7819 7.9224 2.9391 6.0064 4.3129 3.4466 1.0879 1.0885 1.0922 1.0965 1.0939 1.0927 1.0996 1.0860
irintensity: 0.2034 0.1013 2.2104 1.9751 4.2523 15.7887 7.5043 17.9845 6.9049 3.2661 0.7487 3.2169 7.5874 4.7611 1.3373 32.3586 14.3539 13.2737 1.2944 6.4770 2.3903 3.2575 27.7817 32.4996 20.3670 31.7253 47.3657 2.9518 119.9545 6.6055 42.2515 0.8722 0.4754 0.8789 13.4636 2.9994 8.4256 1.5931 18.1080 39.0986 11.4479 114.0358 11.8546 46.0335 10.6191 4.1612 25.3659 2.9200 3.2710 81.9127 195.4783 29.0341 36.1006 30.0249 21.0751 435.2341 507.5163 28.0231 15.3742 39.7720 115.1955 93.5011 0.7109 2.0480 9.2978 3.5181 0.5390 0.9418 810.0010
temp: 298.150 k
press: 1.00000 atm
elementType: 6 6 6 6 6 6 1 6 1 1 6 6 1 1 1 7 5 7 7 8 8 8 8 1 1
symmnumber: 1
zpe: 472272.4 jmol-1
zpe.correction: 0.179879 hartree
zpe.thermalcorrener: 0.193395 hartree
zpe.thermalcorrenthalpy: 0.194339 hartree
zpe.thermalcorrgfe: 0.138393 hartree
zpe.sumelectzpe: -837.428154 hartree
zpe.sumelectthermal: -837.414638 hartree
zpe.sumelectthermalent: -837.413693 hartree
zpe.sumelectthermalfe: -837.469640 hartree
dipole: -16.2888 -0.8341 -1.2844
dipole: 16.3607
quadrupole: -98.6155 -88.2379 -104.4757
quadrupole: 4.0318 2.1936 12.9053
quadrupole: -1.5058 8.8718 -7.3660 4.0318 2.1936 12.9053
hfenergy: -837.6080327 hartree
pointgroup: C01 [X(C9H8B1N3O4)]
dipole: -6.4085256 -0.3281642 -0.505304 debye
dipolederiv: 0.1628402 0.1142066 0.0089066 0.0556274 -0.0287775 0.0064482 -0.0163667 -0.0260116 -0.0669413 -0.18533 -0.2005886 -0.0008868 -0.0895023 -0.407517 0.0037023 0.0105165 0.0012241 -0.2087958 0.4044054 0.6077075 0.1411569 -0.0142198 0.0777612 -0.0467505 0.0035884 -0.0800574 0.1180083 -0.6812288 -0.5653989 -0.1320461 0.1072526 0.0183236 0.0187474 0.0186766 0.0135377 0.0333495 0.0473886 -0.0353332 -0.0093406 -0.0047006 0.0808531 0.0529504 0.0042391 0.0613921 -0.1247164 -0.201951 -0.1548739 -0.034252 -0.0400053 0.1917342 0.0799776 -0.0177253 0.0757433 -0.0714315 0.0962461 -0.0456036 -0.0385748 -0.0564588 0.0885603 -0.0097327 -0.0412809 0.0166052 0.1306852 0.4088997 0.2618928 0.0643297 0.0815801 0.7162606 0.1613659 0.0181416 0.173727 0.0280164 -0.0317843 0.0771299 0.0177754 0.0226099 0.0673637 -0.0212607 0.0027573 -0.0273818 0.1479223 0.0842299 -0.0001425 0.0000392 0.0096787 -0.0586314 -0.0566468 0.0062016 -0.0532542 0.1366886 -0.0522399 0.4418691 0.093851 0.1065528 -0.7592868 -0.1285017 0.0364978 -0.1149221 -0.1901827 0.5605745 -0.6335915 -0.1279545 0.0011299 0.235237 0.0378669 0.002793 0.0099753 0.0862475 0.02374 0.0332737 0.007023 0.0721819 0.0783202 -0.0124555 0.0164934 -0.0191211 0.1320504 0.0418343 -0.0428819 -0.0145956 -0.0446795 0.0763787 -0.0219794 -0.0098175 -0.0187353 0.1691389 0.1035865 0.0242183 0.0048441 0.0071745 0.0777662 -0.0157175 -0.0035629 -0.0178218 0.1495717 -0.8251585 0.3106149 -0.0285012 0.0685826 -0.1352196 0.0513152 -0.0288396 0.0100811 -0.1625822 1.0273121 -0.0518145 -0.1644176 -0.1200013 0.5862145 -0.0961997 -0.1519667 -0.1631962 0.6904535 1.245296 -0.6028263 0.1148794 -0.6961793 1.4675677 -0.357807 0.1045212 -0.3471327 0.2035259 0.7658266 0.6639075 0.5936834 0.7629822 1.0534858 0.3297821 0.8465101 0.2112756 0.7944663 -0.7144692 -0.0797847 0.0854975 0.4885293 -1.2304106 0.2728667 -0.0418401 0.322788 -0.3948794 -1.3130666 0.6134966 -0.0946289 0.1971522 -0.726666 0.1472214 0.0469966 0.0679965 -0.2986575 -0.6774882 -0.2965212 -0.3372787 -0.1506165 -0.4985811 0.0164904 -0.77073 -0.2131652 -0.8697058 -0.8955431 -0.2594933 -0.3347305 -0.542012 -1.0938986 -0.2698202 -0.2499734 0.1711214 -0.5384997 -0.2177703 -0.0116563 0.0277848 0.0123889 -0.1935643 -0.0680588 0.0374396 -0.0322634 -0.2384923 0.8238499 -0.1678065 0.1574364 -0.2350475 0.3167263 -0.0738041 0.1767304 -0.0224046 0.3447603 unknown
polarizability: 218.3754314|16.1372462|212.4952798|12.2451004|18.9719688|106.4551937 unknown
InChI: InChI=1/C9H8BN3O4/c14-12(15)10(13(16)17)8-5-1-3-7-4-2-6-11-9(7)8/h1-6,10-11H
charge 0 multiplicity 1
25 atoms
C  0.07057637 1.96098075 0.35389854
C  0.115839 0.63481954 -0.02130869
C  -1.14436718 -0.01035257 -0.13595811
C  -2.37500722 0.67279535 0.03289265
C  -2.34469243 2.04204529 0.39087619
C  -1.14019603 2.65967442 0.56710717
H  0.99923476 2.50596074 0.45712549
C  -3.57729519 -0.03802052 -0.15172444
H  -3.27916836 2.57439042 0.52473516
H  -1.1008361 3.70357221 0.85431727
C  -3.56867507 -1.37704523 -0.46682859
C  -2.34185209 -2.02422827 -0.5688065
H  -4.51864033 0.48794096 -0.03421145
H  -4.48161937 -1.937751 -0.60788685
H  -2.24831684 -3.08474168 -0.76101726
N  -1.21170043 -1.35330788 -0.41201487
B  1.46089375 -0.17074555 -0.39910969
N  2.77006686 0.69066523 -0.63672641
N  1.74635421 -1.20672182 0.78956568
O  2.67081009 1.85776499 -0.99918067
O  3.84510556 0.12059553 -0.55973993
O  2.44058037 -0.92531565 1.73849788
O  1.13396992 -2.28362941 0.72204751
H  1.33970833 -0.81749435 -1.40518552
H  -0.32613672 -1.87883561 -0.3708762
