program: Gaussian 16
title: QHBOH-H2
version: ES64L-G16RevC.01
method: RwB97XD
basis: GenECP
operation: Freq
keyword: #N
keyword: Geom=AllCheck
keyword: Guess=TCheck
keyword: SCRF=Check
keyword: GenChk
keyword: RwB97XD/GenECP
keyword: Freq
converged: YES YES YES YES
title: Mulliken charges:
elementType: C C H C N N N B H H H H H O H O H
charge: -0.399007 -0.330478 0.276242 -0.256582 0.244446 0.013068 -0.225677 0.279791 0.430361 0.216530 0.219299 0.218762 -0.080506 -0.542242 0.257393 -0.589811 0.268411
chargesum: -0.00000
title: Mulliken charges with hydrogens summed into heavy atoms:
elementType: C C C N N N B O O
charge: 0.255585 -0.054236 -0.256582 0.244446 0.013068 0.204684 0.199285 -0.284849 -0.321400
1716.lowfreq: -35.0518 -20.2059 -0.0008 -0.0007 -0.0006 12.4149 31.3703 70.2409 104.9206
frequency: -23.6422 69.1441 104.7849 122.0229 174.8568 247.4745 317.9979 324.7967 359.3736 454.4313 500.2556 583.5467 686.1204 719.9904 741.0751 839.2994 846.9415 874.7930 954.3307 983.0025 1005.8956 1050.0099 1079.4809 1082.3119 1145.1221 1157.8691 1159.2806 1213.4165 1224.0943 1336.0516 1398.4055 1449.8110 1453.6629 1480.1563 1486.7856 1518.4429 1609.0831 2304.7883 3087.9439 3177.5536 3201.9340 3308.5208 3598.3959 3965.0853 3982.7558
redmass: 1.0483 4.2921 4.6737 4.2694 1.2569 4.2152 2.7248 1.2702 4.0262 3.8443 6.0327 3.2985 4.8380 4.7275 3.7497 1.2311 1.2499 2.9747 2.2788 1.1578 2.0389 3.5328 3.0401 1.6947 1.5075 1.3403 1.3774 1.7317 1.5945 6.4785 3.8222 1.8762 2.6063 2.1757 1.0397 1.4284 4.5380 1.0771 1.0324 1.1073 1.1064 1.1020 1.0848 1.0662 1.0666
irintensity: 0.0324 0.5102 1.8289 6.0003 43.5166 17.9244 9.1998 157.4496 31.2671 39.4500 9.1533 10.4922 5.2403 5.3571 21.3411 140.8326 2.6244 64.4404 140.5312 267.0573 285.4223 55.3773 28.5329 58.9713 30.8452 1.9464 48.7111 170.0799 80.1884 5.6337 29.7480 18.2687 7.3458 17.3494 18.7940 4.8616 14.2061 430.4467 12.0486 2.3296 0.1075 6.6198 241.5488 33.6156 45.1187
temp: 298.150 k
press: 1.00000 atm
elementType: 6 6 1 6 7 7 7 5 1 1 1 1 1 8 1 8 1
symmnumber: 1
zpe: 349196.5 jmol-1
zpe.correction: 0.133002 hartree
zpe.thermalcorrener: 0.141788 hartree
zpe.thermalcorrenthalpy: 0.142732 hartree
zpe.thermalcorrgfe: 0.098977 hartree
zpe.sumelectzpe: -458.572724 hartree
zpe.sumelectthermal: -458.563938 hartree
zpe.sumelectthermalent: -458.562994 hartree
zpe.sumelectthermalfe: -458.606749 hartree
dipole: 5.7365 5.3875 -1.3871
dipole: 7.9911
quadrupole: -54.3670 -73.4349 -54.8897
quadrupole: -8.7426 6.0417 5.2521
quadrupole: 6.5302 -12.5377 6.0075 -8.7426 6.0417 5.2521
hfenergy: -458.705726 hartree
pointgroup: C01 [X(C3H8B1N3O2)]
dipole: 2.2569203 2.1196127 -0.5457314 debye
dipolederiv: 0.5231316 0.1672308 0.0017776 0.159992 0.2810907 0.0154005 -0.0039506 0.0136333 0.1273013 -0.0980191 -0.0738677 0.3639169 0.0022987 -0.0942573 0.1557123 -0.0745691 -0.0516394 -0.0220611 0.1138063 -0.0346107 -0.028565 -0.0289231 0.184203 0.0013843 -0.0255401 -0.0002663 0.1154685 0.0640988 0.0391157 -0.2607276 0.0627833 -0.0177269 -0.1003282 0.0921061 0.1076692 -0.2179219 -0.3830708 -0.1549624 -0.0771568 -0.1277274 -0.0941497 -0.1276477 -0.1895217 -0.1871204 0.3919459 0.0939931 0.0342102 0.2747301 0.0004559 -0.1196859 0.2592852 0.3458183 0.2820937 -0.6178547 -0.4231076 -0.1193625 -0.2610354 -0.1147866 -0.1290652 -0.1938448 -0.1625453 -0.146841 0.2177963 1.2646642 0.0521582 0.1945334 0.1186511 1.3532453 -0.2157135 0.1889304 -0.1844953 1.4356653 0.4567909 0.0861781 0.0363491 0.0829949 0.3475968 0.0020705 0.0599851 0.0254312 0.3366741 -0.0153466 -0.0253734 -0.0117645 0.0448075 0.0026064 0.0492201 -0.0423023 0.0391781 0.0957215 0.0612896 -0.0258723 -0.0422612 -0.0380063 0.1045325 -0.0024574 0.0368597 0.0369235 0.0031198 0.0055726 0.0067768 0.0455153 -0.0517025 0.0032612 -0.0556743 0.0060113 -0.0810843 0.0599143 -0.4334617 0.0966424 0.1592443 0.0677607 -0.3952886 -0.0851095 0.1597314 -0.1002558 -0.3406229 -0.6629326 0.1598226 -0.2446543 0.0904588 -1.2209738 0.4219659 -0.1388194 0.3147736 -0.9903245 0.1631372 -0.0350372 0.1095446 -0.009673 0.3211276 0.0265658 0.0568695 0.0309076 0.2951049 -0.9164569 -0.1713607 -0.3019516 -0.251694 -0.8642764 -0.1587609 -0.4152534 -0.1003242 -1.1727615 0.1859109 -0.0016876 0.0425052 -0.0076899 0.3377603 0.0079317 0.1061902 0.0014165 0.2828347 unknown
polarizability: 101.0074506|17.2687182|76.2818426|-2.8692136|-6.7241198|92.5117665 unknown
InChI: InChI=1/C3H8BN3O2/c1-7-2-3(4(8)9)5-6-7/h2,4-5,8-9H,1H3
charge 0 multiplicity 1
17 atoms
C  1.51185675 0.18566746 -0.00584224
C  -0.41647785 -1.01455812 1.10179642
H  0.01935215 -0.9995945 2.08568033
C  -1.61002033 -1.52803787 0.64290588
N  0.21627072 -0.47921055 0.02713143
N  -0.47408503 -0.6116663 -1.07488492
N  -1.55356349 -1.23781257 -0.67607674
B  -2.91767752 -2.30916172 1.23472738
H  -2.28144528 -1.51028332 -1.32923151
H  2.27282627 -0.49690597 0.36937715
H  1.72397427 0.45102225 -1.03829939
H  1.47216119 1.08199075 0.61145801
H  -3.61278775 -1.51956452 1.88060416
O  -2.40828874 -3.40505004 2.06179741
H  -3.08638855 -3.71008471 2.66167157
O  -3.62133579 -2.72394531 -0.01263433
H  -4.56462473 -2.76784017 0.12597485
