program: Gaussian 16
title: Me_Ph-H2
version: ES64L-G16RevC.01
method: RwB97XD
basis: GenECP
operation: Freq
keyword: #N
keyword: Geom=AllCheck
keyword: Guess=TCheck
keyword: SCRF=Check
keyword: GenChk
keyword: RwB97XD/GenECP
keyword: Freq
converged: YES YES YES YES
title: Mulliken charges:
elementType: H C C C C H C H C H B C C C C C C H H C C C C C C H H C H H H C H H H N H H H H H H H H
charge: 0.231039 -0.171719 -0.149440 -0.560796 -0.194890 0.247681 -0.176004 0.230349 0.083526 0.215149 -0.335865 -0.306021 -0.033001 0.006338 -0.156834 -0.257319 -0.575826 0.223681 0.217816 0.481320 -0.249018 -0.316710 -0.331622 -0.390894 -0.393934 0.230842 0.223347 -0.414039 0.212461 0.235333 0.217598 -0.338778 0.208949 0.217194 0.249861 0.174352 -0.035639 0.242986 0.190907 0.188769 0.232176 0.204792 0.203669 0.218212
chargesum: -0.00000
title: Mulliken charges with hydrogens summed into heavy atoms:
elementType: C C C C C C B C C C C C C C C C C C C C C N
charge: 0.059320 0.098240 -0.330446 -0.194890 0.039146 0.083526 -0.371503 -0.306021 0.157906 0.238514 0.066847 -0.039503 -0.387057 0.481320 -0.044226 -0.098497 -0.100780 -0.167547 -0.190265 0.251352 0.337226 0.417338
chargesum: 0.00000
1716.lowfreq: -14.2021 -11.4237 -3.1642 -0.0007 -0.0004 -0.0001 23.2667 32.0448 41.5318
frequency: 22.7329 31.8935 41.4733 50.5968 61.7909 66.6166 72.9786 121.5571 166.1310 191.6046 210.8799 214.6687 224.1906 245.4940 251.6421 266.3776 299.4894 353.0780 367.3515 411.0586 414.0032 459.0546 483.3525 499.2687 510.0968 570.5766 592.9349 605.5615 615.2365 635.1407 638.8102 649.7130 719.2926 724.3614 729.2815 752.9254 762.1601 780.1373 788.2145 800.3630 818.3012 854.7110 877.6055 884.7310 898.7070 940.2506 947.8349 951.0641 978.3108 1006.0105 1011.2751 1016.3724 1019.2077 1021.2944 1021.4281 1025.9888 1041.4750 1045.2886 1059.3467 1063.9273 1068.8252 1070.6848 1087.9562 1104.5144 1112.8315 1132.0689 1155.5574 1161.7171 1178.9879 1179.7246 1182.3657 1189.9682 1196.1889 1209.7072 1213.1966 1218.0402 1233.4803 1277.9388 1301.9017 1310.2105 1313.1385 1330.1642 1355.0073 1358.0699 1421.9250 1449.7261 1463.7888 1471.2581 1471.9418 1479.5274 1485.6620 1490.8053 1499.4993 1508.1250 1513.7392 1526.0498 1528.3851 1529.6056 1635.2471 1636.9663 1640.2578 1659.9515 1663.2697 1677.8479 2197.6808 3078.9400 3082.8895 3151.6116 3153.4514 3158.7734 3165.1991 3175.9576 3176.4756 3177.2291 3178.4421 3181.7516 3183.5405 3184.4450 3186.2687 3189.9889 3191.1819 3197.2152 3199.3197 3201.3090 3213.6670 3231.6487
redmass: 3.7938 4.2079 4.6327 4.0404 4.0179 3.7368 3.0029 3.3360 3.6613 3.2564 2.0887 1.6169 4.4091 4.1811 2.4277 1.7804 2.3016 3.3915 3.1912 2.8278 2.8414 3.6576 3.5739 3.6259 3.3811 3.4536 3.4646 5.0741 4.6493 5.8305 6.3948 5.0655 3.0331 1.6830 1.5154 2.6501 2.1184 3.1676 1.7691 3.4600 3.1509 3.2961 1.2588 1.2515 1.3869 1.4243 1.5357 2.6077 1.3714 1.3820 1.3981 1.3173 2.8225 1.7877 4.3263 1.3402 1.9013 1.7550 2.4654 1.9120 1.2176 2.3520 2.3849 1.6546 1.6353 1.4486 1.9416 1.8276 1.1260 1.1416 2.1271 1.2703 1.9930 1.7216 1.1539 1.5075 1.7959 1.8002 2.1918 3.2720 3.6679 3.2432 1.4831 1.4682 1.3149 1.1518 1.3051 2.1396 2.0945 1.1889 1.0483 1.7078 1.2397 1.0476 1.2238 2.1492 1.6509 2.1836 5.4369 5.4472 5.5879 5.7353 5.7533 5.8822 1.0797 1.0313 1.0320 1.0868 1.0873 1.0870 1.0855 1.0902 1.0894 1.1075 1.1009 1.0911 1.0942 1.0941 1.0948 1.1069 1.1059 1.0938 1.0987 1.0987 1.0981 1.0795
irintensity: 0.2543 4.7255 0.4613 2.4974 0.2111 1.1179 0.8542 2.5402 18.5714 0.2157 1.5401 0.4959 0.6601 1.1774 0.5311 3.9861 0.4216 2.9464 3.3343 0.0371 0.0839 6.4872 7.0406 7.1962 11.9489 16.0860 6.2745 3.3284 8.7434 3.3830 0.5530 8.3218 25.2232 56.5993 56.4568 35.5651 22.1714 16.7728 31.6917 1.9046 4.5942 2.2119 0.0153 0.0389 1.2035 6.4334 5.6091 8.4986 1.1277 0.0929 0.1805 0.5142 1.9617 0.8073 0.0491 0.7819 7.5391 50.3478 11.4902 14.0706 4.2885 12.3203 27.5572 9.6399 6.8335 65.8718 17.5780 6.0698 0.6809 1.0268 30.9301 2.9674 1.5623 31.4338 2.0315 31.9095 20.3326 3.0125 13.1956 5.2672 13.6424 6.9834 0.9733 0.7978 86.0088 5.5338 28.3520 6.2501 9.6073 15.3272 4.6673 5.0522 26.9935 25.1176 8.0802 7.4657 55.4365 11.3131 0.2505 0.5207 15.6172 7.8136 5.9278 3.6282 344.3229 11.3353 32.9797 19.7539 13.6535 10.1678 3.8783 5.8997 3.1190 9.9454 14.2394 13.4441 60.5282 54.5795 3.3660 3.3099 18.6718 23.1643 51.0417 35.2864 29.5606 470.5522
temp: 298.150 k
press: 1.00000 atm
elementType: 1 6 6 6 6 1 6 1 6 1 5 6 6 6 6 6 6 1 1 6 6 6 6 6 6 1 1 6 1 1 1 6 1 1 1 7 1 1 1 1 1 1 1 1
symmnumber: 1
zpe: 983557.9 jmol-1
zpe.correction: 0.374617 hartree
zpe.thermalcorrener: 0.394034 hartree
zpe.thermalcorrenthalpy: 0.394979 hartree
zpe.thermalcorrgfe: 0.324939 hartree
zpe.sumelectzpe: -854.522351 hartree
zpe.sumelectthermal: -854.502934 hartree
zpe.sumelectthermalent: -854.501990 hartree
zpe.sumelectthermalfe: -854.572030 hartree
dipole: 3.4948 -9.8813 -0.3625
dipole: 10.4873
quadrupole: -89.8534 -161.3703 -131.5943
quadrupole: -48.0643 -0.7600 -2.6250
quadrupole: 37.7526 -33.7643 -3.9883 -48.0643 -0.7600 -2.6250
hfenergy: -854.8969686 hartree
pointgroup: C01 [X(C20H22B1N1)]
dipole: 1.3749414 -3.8875849 -0.14262 debye
polarizability: 285.5937564|-11.0223269|300.6646718|-32.4751572|4.3868164|282.4943664 unknown
InChI: InChI=1/C20H22BN/c1-22(2)20-16-10-9-15-19(20)21(17-11-5-3-6-12-17)18-13-7-4-8-14-18/h3-16,21-22H,1-2H3
charge 0 multiplicity 1
44 atoms
H  0.50390558 0.40717455 0.44232852
C  1.57933776 0.31018576 0.33803278
C  2.37868756 1.44775088 0.33318767
C  2.1471395 -0.95416196 0.21015986
C  3.77108622 1.3804081 0.19660249
H  1.91679862 2.42417532 0.43942729
C  3.52449122 -1.07067367 0.07921196
H  1.52635125 -1.84233524 0.21287827
C  4.28291531 0.0897573 0.07565954
H  3.98151538 -2.04982705 -0.02055342
B  4.76800438 2.67760005 0.10668093
C  4.05752431 4.02256463 0.6584449
C  3.66877572 5.08178732 -0.16894777
C  3.76740833 4.15829384 2.02456871
C  3.022984 6.21175558 0.33130864
C  3.12411707 5.27809615 2.53843492
C  2.74613689 6.31526395 1.68889738
H  2.73760114 7.01397372 -0.34246684
H  2.91826751 5.34655484 3.60238289
C  5.33553011 2.79719389 -1.4183612
C  4.51641637 2.58010236 -2.5364148
C  6.67836402 3.09842414 -1.68029088
C  5.00489022 2.65216828 -3.83732528
C  7.18477695 3.16834527 -2.97627028
C  6.34792942 2.94110944 -4.06335615
H  4.33931975 2.47928366 -4.67737187
H  8.2325147 3.40224603 -3.13826668
C  6.18442071 -0.48116616 -1.41116772
H  5.71460017 0.15031971 -2.16279097
H  7.26866769 -0.40074716 -1.4801538
H  5.8744246 -1.51849173 -1.53119126
C  6.40149228 -0.75412624 1.03917573
H  6.09798512 -1.79833848 0.99318888
H  7.48280921 -0.67496944 0.93212037
H  6.08126695 -0.31228352 1.98084092
N  5.75532893 -0.00385317 -0.06860407
H  5.7468531 2.43995029 0.84416627
H  6.05154303 0.98410225 0.03394401
H  3.87731289 5.02679845 -1.23371461
H  2.24538632 7.19338376 2.08317031
H  4.05451065 3.358723 2.70386948
H  3.46777492 2.33744948 -2.38256141
H  6.73551857 2.99302445 -5.0752805
H  7.34618373 3.28270174 -0.84180634
