program: Gaussian 09
title: 000075855
version: EM64L-G09RevD.01
frameworkgroup: C1[X(C13H16N2O5)]
method: RPBEPBE
basis: SDD
operation: Freq
keyword: #p
keyword: freq=noraman
keyword: PBEPBE/SDD
title: #p freq=noraman PBEPBE/SDD
converged: YES YES NO NO
title: Mulliken charges:
elementType: O O O O O N N C C C C C C C C C C C C C H H H H H H H H H H H H H H H H
charge: -0.298502 -0.440373 -0.214335 -0.255726 -0.286010 -0.416606 -0.620958 -0.163107 -0.395579 -0.511481 0.143911 0.238533 0.292462 -0.422561 0.472522 -0.383112 -0.387127 -0.225516 -0.224876 -0.232026 0.301639 0.294654 0.240990 0.214006 0.250637 0.363709 0.236966 0.229953 0.234421 0.236969 0.312852 0.336676 0.390654 0.227843 0.228351 0.230147
chargesum: 0.00000
title: Mulliken charges with hydrogens summed into heavy atoms:
elementType: O O O O O N N C C C C C C C C C C C C C
charge: -0.298502 -0.049719 -0.214335 -0.255726 -0.286010 -0.052898 0.028570 0.138532 0.140065 -0.046839 0.143911 0.238533 0.292462 0.044358 0.472522 -0.148690 -0.150158 0.002327 0.003475 -0.001879
polarizability: 2.07189585e+02 2.27355544e+00 1.59337633e+02 -1.61361269e+01 -1.31542026e+00 1.39726861e+02
1716.lowfreq: -11.3883 -4.9763 -2.7702 -2.5737 -0.0006 -0.0002 0.0004 13.9560 22.7435
frequency: -8.5357 13.0013 22.7183 25.0030 37.3257 42.6556 63.9199 67.0144 88.0425 109.3506 121.3873 159.7003 195.0379 203.6625 221.9736 266.2800 319.7913 320.4001 368.6073 402.8609 414.9140 447.2643 487.1518 497.6130 525.9622 529.8717 559.1578 578.5106 581.5762 591.5803 617.5778 638.9180 666.5544 686.8326 700.0741 704.3533 720.6266 758.4799 777.8691 811.1454 837.2262 854.4473 876.2877 894.8812 919.9124 934.6652 950.9151 977.8660 985.4023 990.9715 997.9133 1011.4014 1027.1614 1053.3828 1073.4833 1088.8661 1091.0340 1140.5587 1173.2074 1184.8129 1186.9971 1193.0078 1197.6728 1222.7019 1228.5996 1268.3150 1281.3868 1298.1626 1321.2992 1325.0090 1347.6065 1357.2679 1373.0134 1386.2883 1440.6379 1443.3975 1468.8855 1470.2133 1477.2404 1488.0858 1596.5281 1596.6432 1617.9674 1644.9333 1651.5877 1673.6010 2975.2314 3006.1968 3013.7604 3023.2593 3032.9212 3077.7979 3092.5194 3121.9584 3124.5176 3136.2652 3148.9111 3164.8194 3516.4389 3524.9466 3569.4856 3673.4706
redmass: 4.2576 4.7103 4.9130 6.3518 9.5791 6.4125 9.0648 5.3262 3.1828 4.4705 5.6016 5.6000 3.8507 6.1157 6.1765 5.8801 2.2207 4.0989 6.7159 2.7985 2.6816 3.9808 1.5238 2.5613 1.8964 2.9745 4.4049 3.1373 1.3575 1.6314 6.3359 1.5863 2.0048 5.8730 7.6677 1.8376 4.9939 2.0334 1.5734 3.4366 3.6844 1.2466 3.7137 3.8737 3.0961 1.7365 1.6206 1.3924 5.2276 6.1463 1.3238 2.3437 2.1789 1.9411 2.9650 1.5137 1.9678 3.1129 1.0540 1.3754 1.1584 1.1855 1.7312 1.3095 2.3750 1.5242 1.5415 1.2850 1.9483 1.2749 1.5357 1.4766 2.0742 8.7621 2.1952 1.0966 1.1679 1.5756 1.2079 2.4090 1.4246 5.9301 6.2184 3.7868 9.5057 9.0385 1.0585 1.0799 1.0577 1.0670 1.0971 1.1079 1.1035 1.0851 1.0883 1.0921 1.0964 1.1017 1.0446 1.0644 1.0777 1.1042
irintensity: 0.0596 0.0417 10.5667 2.9725 5.6033 0.1125 3.5171 0.3082 0.3933 2.2574 5.5492 7.4054 0.5293 7.7407 14.2433 5.2769 1.1967 1.3960 1.4074 0.0034 4.9484 7.2667 39.9106 60.1268 114.1652 78.9503 26.0620 23.3269 65.3922 47.0765 0.1114 132.3473 46.8435 18.3841 55.2508 45.7894 2.3061 73.6665 19.4932 5.3374 12.8412 0.0133 4.1277 46.6666 15.7659 2.1692 1.9251 0.0563 297.2692 0.5862 0.3117 155.7812 1.4785 52.6178 25.3357 6.4557 67.3190 69.8949 0.0136 5.3607 17.2732 43.4719 219.6901 7.7313 11.1234 80.6435 49.6890 27.3889 40.0026 0.2748 85.2621 13.6995 87.5145 0.3864 9.1236 11.1723 144.9031 319.3863 77.7536 24.6760 61.6929 0.1153 0.0866 155.8446 369.2831 218.9692 18.5849 9.6387 22.7002 11.2496 21.3904 13.1486 11.4798 4.1803 1.6497 15.7591 40.3024 20.5846 31.2803 32.0907 68.2127 22.4314
temp: 298.150 k
press: 1.00000 atm
elementType: 8 8 8 8 8 7 7 6 6 6 6 6 6 6 6 6 6 6 6 6 1 1 1 1 1 1 1 1 1 1 1 1 1 1 1 1
symmnumber: 1
zpe: 736712.5 jmol-1
zpe.correction: 0.280599 hartree
zpe.thermalcorrener: 0.300034 hartree
zpe.thermalcorrenthalpy: 0.300978 hartree
zpe.thermalcorrgfe: 0.227881 hartree
zpe.sumelectzpe: -989.152352 hartree
zpe.sumelectthermal: -989.132917 hartree
zpe.sumelectthermalent: -989.131973 hartree
zpe.sumelectthermalfe: -989.205070 hartree
dipole: 0.1799 -0.6779 -6.2176
dipole: 6.2570
quadrupole: -99.5147 -112.9048 -116.4664
quadrupole: -6.0195 16.6615 -5.4540
quadrupole: 10.1139 -3.2762 -6.8378 -6.0195 16.6615 -5.4540
hfenergy: -989.4329508 hartree
pointgroup: C01 [X(C13H16N2O5)]
dipole: 0.1172472 -0.0883377 -2.4573101 debye
polarizability: 207.7643524|3.4562223|159.4275858|-14.6412904|0.1776674|139.0621416 unknown
InChI: InChI=1S/C13H16N2O5/c14-11(16)7-6-10(12(17)18)15-13(19)20-8-9-4-2-1-3-5-9/h1-5,10,15,17H,6-8,14H2
charge 0 multiplicity 1
36 atoms
O  1.273417 -0.455021 0.314022
O  -2.238797 -2.191717 -1.955042
O  -4.109955 -2.642154 -0.653761
O  -3.563043 2.837043 0.989708
O  -0.188411 -0.69741 2.156387
N  -0.908744 -0.971186 -0.060553
N  -4.708219 2.918581 -1.023699
C  -2.291444 -1.285584 0.309568
C  -3.146145 -0.020353 0.636391
C  -3.301449 0.939275 -0.559816
C  -2.985873 -2.113797 -0.766258
C  -3.863314 2.298349 -0.11528
C  0.027282 -0.708385 0.915471
C  2.37976 -0.153166 1.28417
C  3.611418 0.170304 0.475264
C  4.508624 -0.857119 0.08901
C  3.887913 1.505905 0.088421
C  5.658635 -0.557648 -0.674614
C  5.037118 1.809798 -0.674869
C  5.925137 0.777572 -1.058248
H  -2.276565 -1.89839 1.23224
H  -2.654575 0.515177 1.466716
H  -4.136767 -0.355095 0.993973
H  -3.935897 0.4963 -1.352011
H  -2.302301 1.12767 -1.002597
H  -0.613964 -1.043562 -1.035278
H  2.055334 0.690373 1.918689
H  2.51899 -1.040041 1.927741
H  4.302773 -1.892546 0.386343
H  3.199875 2.30663 0.385548
H  -4.973195 2.482559 -1.904862
H  -5.080445 3.83933 -0.790658
H  -2.732661 -2.735531 -2.625993
H  6.346023 -1.359418 -0.966445
H  5.241945 2.845867 -0.966501
H  6.819018 1.012089 -1.647278
