program: Gaussian 16
title: MeQHBPh2-H2
version: ES64L-G16RevC.01
method: RwB97XD
basis: GenECP
operation: Freq
keyword: #N
keyword: Geom=AllCheck
keyword: Guess=TCheck
keyword: SCRF=Check
keyword: GenChk
keyword: RwB97XD/GenECP
keyword: Freq
converged: YES YES NO YES
title: Mulliken charges:
elementType: C H C N N N B C H H H C C C C C C C C C C C C H H H H H H H H H H H H
charge: -0.437033 0.306499 -0.461554 0.323963 0.100611 -0.177567 0.082394 -0.351488 0.224083 0.214867 0.221793 0.319349 -0.308821 -0.376869 -0.285597 -0.040574 -0.520043 0.599170 -0.447072 -0.232705 -0.437326 -0.129459 -0.492388 -0.199268 0.459722 0.221319 0.176809 0.197504 0.213612 0.190680 0.224932 0.220146 0.192881 0.224714 0.182717
chargesum: -0.00000
title: Mulliken charges with hydrogens summed into heavy atoms:
elementType: C C N N N B C C C C C C C C C C C C C
charge: -0.130535 -0.461554 0.323963 0.100611 0.282155 -0.116874 0.309255 0.319349 -0.111317 -0.200060 -0.071985 0.180745 -0.329364 0.599170 -0.222140 -0.049988 -0.217179 0.095254 -0.299507
chargesum: 0.00000
1716.lowfreq: -10.7734 -6.2808 -0.8433 -0.0003 0.0004 0.0005 19.9905 21.2291 38.7029
frequency: 18.8508 20.6638 38.6813 49.3071 56.6071 63.2086 70.1871 159.6560 179.2274 213.4400 247.5683 254.8371 261.2715 311.7402 408.2982 412.7850 415.5860 480.0376 491.1721 600.2340 612.0381 624.1404 639.4136 642.9632 687.2266 712.8679 725.6099 728.5061 738.0412 756.5641 769.7990 790.0734 807.3304 828.8812 844.1528 879.1661 882.4080 940.5105 944.8741 1006.5708 1009.2476 1016.4381 1018.9271 1020.5241 1021.3281 1028.6586 1042.4316 1058.5506 1067.5372 1077.6651 1082.6595 1093.7241 1106.0138 1108.9126 1151.5053 1160.2498 1177.5504 1179.1520 1180.7079 1207.0695 1213.4110 1215.0331 1240.3650 1307.3578 1310.8425 1318.2960 1353.9367 1356.1200 1412.5167 1450.5189 1457.7496 1471.2145 1472.5091 1485.0025 1489.4680 1520.7964 1527.5976 1528.2473 1607.3091 1636.3256 1636.9003 1661.3131 1663.8841 2366.9063 3089.8863 3144.4384 3150.1738 3165.7626 3166.3723 3176.2708 3177.1196 3180.4695 3184.2503 3185.6096 3199.7463 3201.4301 3203.1633 3300.6215 3642.7791
redmass: 3.8065 4.0885 4.3368 4.6793 1.1076 3.8443 4.1067 4.0075 4.2405 4.3784 5.3984 4.7012 4.5416 4.8805 3.1072 2.8460 2.8550 3.6479 3.6517 5.4288 4.6568 3.9338 6.3695 5.7406 5.3569 4.5277 1.5624 1.4560 2.9914 2.9775 1.2336 2.2802 2.4386 3.0648 1.6101 1.2526 1.2488 1.4035 1.4018 1.3789 1.3748 1.4022 1.6959 2.6357 4.3049 2.0882 1.7256 2.7543 1.8300 1.9048 2.6061 2.2052 1.5848 1.5549 1.8873 1.3409 2.6863 1.1309 1.1482 1.9982 1.1602 1.4831 2.1399 4.1505 3.9782 6.4544 1.4890 1.4796 3.6542 2.3924 1.4569 2.1417 2.1576 1.1619 2.0114 1.4160 2.1861 2.2002 3.5472 5.4221 5.4851 5.7781 5.8043 1.0847 1.0322 1.0875 1.0870 1.0861 1.0856 1.0903 1.0897 1.1072 1.0941 1.0943 1.0987 1.0988 1.1067 1.1020 1.0838
irintensity: 0.5662 0.2753 0.5228 2.1290 0.2297 0.5899 1.2907 0.3938 0.8428 2.6432 3.2836 1.3375 0.2276 8.3056 4.4304 0.3065 0.0282 5.2874 14.8635 3.3412 3.9536 8.3071 0.3361 0.2601 5.6912 6.8282 74.7180 59.6697 37.6619 28.5233 77.5400 11.5101 9.4783 2.4389 17.6563 0.5056 0.0907 7.6939 1.2295 0.0845 0.1025 3.6707 3.3127 4.2250 1.3354 53.0317 51.7860 3.6903 0.4285 2.0429 8.4284 77.4442 9.2315 3.7008 20.4526 0.2283 43.8739 0.3430 1.6997 17.0916 4.4307 17.8476 88.1025 7.6556 11.1601 0.8965 0.1929 0.7769 37.1792 13.3561 9.6257 7.3246 8.4398 20.5492 28.1110 5.6685 8.4649 9.9909 51.4269 0.7667 1.0378 8.9819 1.8233 236.0355 12.6946 26.0151 19.2999 6.1286 3.9039 9.4175 4.5133 1.7768 52.0382 61.4904 42.2488 32.8598 0.1695 8.2389 156.5800
temp: 298.150 k
press: 1.00000 atm
elementType: 6 1 6 7 7 7 5 6 1 1 1 6 6 6 6 6 6 6 6 6 6 6 6 1 1 1 1 1 1 1 1 1 1 1 1
symmnumber: 1
zpe: 753617.8 jmol-1
zpe.correction: 0.287038 hartree
zpe.thermalcorrener: 0.303437 hartree
zpe.thermalcorrenthalpy: 0.304381 hartree
zpe.thermalcorrgfe: 0.239106 hartree
zpe.sumelectzpe: -769.949650 hartree
zpe.sumelectthermal: -769.933250 hartree
zpe.sumelectthermalent: -769.932306 hartree
zpe.sumelectthermalfe: -769.997582 hartree
dipole: -5.3402 6.9344 -5.0930
dipole: 10.1263
quadrupole: -154.2000 -99.4088 -121.9732
quadrupole: 22.7131 -25.9031 1.7659
quadrupole: -29.0060 25.7852 3.2208 22.7131 -25.9031 1.7659
hfenergy: -770.2366875 hartree
pointgroup: C01 [X(C15H16B1N3)]
dipole: -2.1010106 2.7282151 -2.0037235 debye
polarizability: 245.7353971|21.114858|233.1043129|-14.806561|-28.6716388|232.123026 unknown
InChI: InChI=1/C15H16BN3/c1-19-12-15(17-18-19)16(13-8-4-2-5-9-13)14-10-6-3-7-11-14/h2-12,16-17H,1H3
charge 0 multiplicity 1
35 atoms
C  3.40884003 1.45459105 0.43398751
H  4.31191963 2.03495687 0.35054399
C  3.19251502 0.20338522 0.97614877
N  2.21210098 1.90515369 -0.01816529
N  1.24758977 1.05390616 0.19315699
N  1.85593298 0.0509885 0.78462218
B  4.14906505 -0.91602959 1.65367596
C  1.92929896 3.17151052 -0.68041165
H  0.85320508 3.2460133 -0.81390342
H  2.28771565 3.98642163 -0.05386962
H  2.43044263 3.19150098 -1.64713416
C  5.55882045 -0.20463038 2.03897272
C  6.49498275 0.09261511 1.03689491
C  5.89659318 0.18294628 3.34115071
C  7.69083691 0.74982372 1.30919232
C  7.09225691 0.8374462 3.63024254
C  7.99485608 1.12868876 2.61366891
C  3.36760387 -1.61060497 2.89436866
C  3.43139839 -2.99453186 3.10442421
C  2.62446402 -0.87407667 3.82978959
C  2.80072369 -3.6101292 4.18178309
C  1.98537366 -1.47486796 4.91120474
C  2.07134022 -2.8511636 5.09153349
H  4.34124095 -1.74551556 0.77120346
H  1.30253924 -0.74187216 1.08255673
H  7.32176485 1.11653771 4.65409557
H  5.21254955 -0.04052941 4.15485481
H  6.28341753 -0.21291738 0.01438286
H  8.39257791 0.9566263 0.5067609
H  8.9285674 1.6348272 2.83542088
H  3.9953047 -3.6029919 2.40294501
H  2.87596321 -4.68531051 4.31136722
H  1.57650313 -3.32664282 5.93174464
H  1.42317254 -0.86921116 5.61530687
H  2.54785866 0.20590139 3.71743863
