program: Gaussian 16
title: QHBbicyclo-TS1
version: ES64L-G16RevC.01
method: RwB97XD
basis: GenECP
operation: Freq
keyword: #N
keyword: Geom=AllCheck
keyword: Guess=TCheck
keyword: SCRF=Check
keyword: GenChk
keyword: RwB97XD/GenECP
keyword: Freq
converged: YES YES YES YES
title: Mulliken charges:
elementType: C C H C N N N H H H H H B C C C H C C H C C H H H H C H H H H H H H H
charge: -0.356702 -0.353166 0.277215 -0.769445 0.361895 -0.327330 0.139589 0.372556 -0.157652 0.207948 0.219776 0.202573 0.303043 0.345358 0.346239 -0.708677 0.208325 -0.655726 -0.707761 0.208204 -0.656930 -0.089423 0.159941 0.166678 0.130976 0.176462 -0.307195 0.160005 0.166699 0.132822 0.176782 0.194441 0.121325 0.130787 0.180368
chargesum: -0.00000
title: Mulliken charges with hydrogens summed into heavy atoms:
elementType: C C C N N N B C C C C C C C C
charge: 0.273595 -0.075951 -0.769445 0.361895 -0.327330 0.512146 0.145392 0.553683 0.554443 -0.382058 -0.348287 -0.381057 -0.347327 0.226343 0.003960
chargesum: 0.00000
1716.lowfreq: -1337.0338 -7.0444 -5.7984 0.0003 0.0005 0.0006 5.1572 51.2330 56.8180
frequency: -1337.0338 51.0910 56.7326 71.0206 83.2929 137.8927 195.7719 202.3152 237.8640 253.4467 305.8493 336.5609 341.0960 383.0806 401.3720 417.1322 499.9850 554.3454 597.4657 663.2696 685.1497 695.7507 717.8982 728.5865 752.6115 791.0949 807.4418 825.8443 832.3792 859.8871 878.0447 907.3779 917.3466 956.5017 958.6515 1016.2476 1019.4769 1070.6779 1078.4547 1081.6721 1084.0228 1089.8118 1099.8594 1122.1450 1135.5923 1140.3815 1152.6048 1157.1492 1159.7683 1181.1476 1190.2514 1206.5453 1247.3448 1262.2688 1291.3289 1315.0917 1324.8663 1327.1415 1335.9162 1338.6674 1357.7441 1360.3753 1377.3835 1384.4637 1390.2175 1393.9396 1398.9048 1401.3086 1452.0274 1475.8826 1481.7199 1483.2169 1487.6552 1492.5666 1496.9300 1500.1372 1513.8369 1530.2773 1592.9642 1775.8913 1868.4968 2998.4891 2999.5011 3003.4423 3004.4124 3022.5658 3024.2765 3035.4246 3038.4414 3039.1838 3042.2711 3044.5374 3049.2390 3080.8951 3092.4799 3119.0543 3165.7490 3195.0394 3295.3776
redmass: 1.1009 2.1445 1.3330 3.4305 4.6615 2.3515 3.0995 2.6129 3.2839 2.8698 2.7974 2.9604 2.9188 1.7317 4.0490 3.3090 1.9588 3.6236 4.4361 2.5894 1.4551 3.7384 1.6099 6.4407 3.0216 3.5001 1.9664 1.5016 2.9161 1.3952 2.3466 2.3165 1.5781 2.2195 3.1062 1.7435 2.0126 2.2845 5.1927 1.8910 2.0840 2.1086 1.8944 1.5081 1.6413 1.2784 1.3234 1.4694 1.0406 1.5789 1.0835 1.6732 1.6679 1.3884 1.2148 2.0390 4.0649 1.5179 1.3536 2.4939 1.3239 1.7373 1.3705 1.3552 1.3630 1.7643 1.4681 3.0965 1.5432 2.2368 1.0746 1.0859 1.0386 1.0860 1.0855 1.0985 1.2612 1.0859 5.2350 1.0866 1.0686 1.0653 1.0642 1.0609 1.0604 1.0795 1.0794 1.0997 1.1031 1.1012 1.1025 1.0717 1.0715 1.0330 1.0970 1.0895 1.1068 1.1052 1.1010
irintensity: 4586.2010 1.1597 0.1707 1.4214 5.6343 0.0141 0.8328 0.6506 0.1652 3.4193 0.1224 0.8728 0.0641 0.0321 0.0044 1.4883 0.9510 1.4020 0.0004 7.9472 1.3445 2.1600 14.3262 0.9473 49.3013 25.5392 1.6967 27.2791 1.3417 0.0059 8.8474 7.8961 8.2352 0.1874 91.9900 1.0295 5.7963 24.7743 0.8386 15.1793 34.8820 0.1084 12.6403 0.0214 21.0680 1.9986 2.2848 32.8866 0.0709 159.9592 16.1057 1.7114 17.9602 1.2059 1.6199 23.1104 12.9516 5.8817 3.4216 66.6313 0.0144 8.7233 1.3649 1.3495 0.1834 4.9457 0.0040 5.0450 11.2599 22.0009 0.3006 0.1842 17.0572 10.8878 3.8357 14.2705 4.2528 13.8829 5.0350 540.8381 167.1263 16.2785 48.1525 95.2459 7.8907 274.7597 53.9715 58.5371 23.2371 147.1579 14.0738 114.6118 51.7363 24.5531 73.3645 86.6965 5.8283 0.6929 1.6669
temp: 298.150 k
press: 1.00000 atm
elementType: 6 6 1 6 7 7 7 1 1 1 1 1 5 6 6 6 1 6 6 1 6 6 1 1 1 1 6 1 1 1 1 1 1 1 1
symmnumber: 1
zpe: 801491.4 jmol-1
zpe.correction: 0.305272 hartree
zpe.thermalcorrener: 0.318638 hartree
zpe.thermalcorrenthalpy: 0.319582 hartree
zpe.thermalcorrgfe: 0.264900 hartree
zpe.sumelectzpe: -619.908704 hartree
zpe.sumelectthermal: -619.895338 hartree
zpe.sumelectthermalent: -619.894394 hartree
zpe.sumelectthermalfe: -619.949076 hartree
dipole: 6.2774 -0.9892 -0.2962
dipole: 6.3618
quadrupole: -107.1615 -95.3791 -97.9131
quadrupole: -11.4538 4.2733 0.5365
quadrupole: -7.0103 4.7722 2.2381 -11.4538 4.2733 0.5365
hfenergy: -620.213976 hartree
pointgroup: C01 [X(C11H20B1N3)]
dipole: 2.4697143 -0.3891998 -0.1165149 debye
polarizability: 218.9406646|10.0609901|177.3299444|-9.9765392|-9.6943784|154.4254738 unknown
InChI: InChI=1/C11H20BN3/c1-15-8-11(13-14-15)12-9-4-2-5-10(12)7-3-6-9/h8-10,12-13H,2-7H2,1H3
charge 0 multiplicity 1
35 atoms
C  1.76372366 -0.96215986 0.07479342
C  -0.55022934 -1.84327233 0.59003189
H  -0.20584352 -2.82354834 0.87288757
C  -1.79927346 -1.27403802 0.52642333
N  0.31763328 -0.87215775 0.19400431
N  -0.3052388 0.25135201 -0.10895939
N  -1.56497772 -0.00742028 0.09541546
H  -2.84316699 0.27711163 0.1258753
H  -3.73041618 -0.13770777 0.34371009
H  2.02570846 -1.69349835 -0.68956341
H  2.13381662 0.01937016 -0.21138669
H  2.191631 -1.25375835 1.03343609
B  -3.38084986 -1.45129529 0.73599813
C  -4.16759466 -2.45146918 -0.24037895
C  -3.93080674 -1.64958175 2.22961792
C  -5.67825428 -2.15609851 -0.18116234
H  -3.85223666 -2.33862115 -1.2858978
C  -3.77518021 -3.88189822 0.19552378
C  -5.44333008 -1.36015751 2.27012514
H  -3.44729729 -0.96640203 2.94008988
C  -3.53998548 -3.08526193 2.64932733
C  -6.28747095 -2.11860657 1.23118535
H  -6.23586438 -2.88233204 -0.78774945
H  -5.83912205 -1.17819618 -0.6537782
H  -2.71049509 -4.0202265 -0.03832677
H  -4.31334442 -4.62525709 -0.40736926
C  -3.99412868 -4.19723743 1.68639552
H  -5.84692118 -1.56434653 3.27097838
H  -5.57484694 -0.28291433 2.10340202
H  -2.44487294 -3.12066053 2.73262161
H  -3.92408212 -3.30661426 3.6538994
H  -7.27881034 -1.6547833 1.17553296
H  -6.46587416 -3.13808545 1.57938653
H  -5.04869642 -4.41900439 1.85949791
H  -3.45930796 -5.12114709 1.93508447
