program: Gaussian 16
title: Me_Borole-TS1
version: ES64L-G16RevC.01
method: RwB97XD
basis: GenECP
operation: Freq
keyword: #N
keyword: Geom=AllCheck
keyword: Guess=TCheck
keyword: SCRF=Check
keyword: GenChk
keyword: RwB97XD/GenECP
keyword: Freq
converged: YES YES YES YES
title: Mulliken charges:
elementType: H C C C H C H C H C H H H C H H H N H H C B C C C H C H H H
charge: 0.219507 -0.660530 -0.182996 -0.343054 0.225214 -0.147109 0.226646 -0.210580 0.177142 -0.449818 0.156966 0.195176 0.170255 -0.347408 0.139880 0.165459 0.194200 0.097395 0.099260 0.073803 0.476353 -0.027359 -0.285303 -0.489997 -0.226431 0.141107 -0.045644 0.210709 0.222804 0.224351
chargesum: -0.00000
title: Mulliken charges with hydrogens summed into heavy atoms:
elementType: C C C C C C C N C B C C C C
charge: -0.441023 0.042218 -0.116408 0.030033 -0.210580 0.072580 0.152131 0.097395 0.476353 0.145705 -0.144196 -0.279289 -0.003627 0.178707
chargesum: 0.00000
1716.lowfreq: -320.6400 -2.7830 -0.0006 -0.0005 -0.0003 7.1611 9.4692 48.7602 66.1653
frequency: -320.6346 48.7171 66.1262 86.3627 115.0977 134.6008 173.5160 229.6436 257.2838 271.2207 288.6704 327.1978 351.1972 377.8752 392.9415 444.3122 492.4432 514.1441 525.7790 563.9355 571.3174 587.8549 611.0559 663.5710 733.4550 746.3605 760.8820 763.5356 781.8670 793.6483 810.3814 904.7908 926.9072 975.1723 980.1215 986.4667 1001.5382 1004.1582 1013.9627 1020.3561 1044.5492 1076.0260 1080.4944 1102.8735 1118.5515 1122.8435 1138.2036 1181.3530 1189.1630 1195.2504 1242.8683 1260.2202 1301.9171 1320.1757 1322.0345 1348.6481 1385.4010 1446.2377 1469.9300 1481.3024 1485.4454 1495.8477 1505.8931 1521.6597 1532.1731 1600.3947 1637.0579 1650.0010 1667.5013 2967.3847 2974.5250 3080.1151 3082.3455 3133.6230 3154.1642 3169.2657 3177.0432 3181.7719 3186.8949 3200.1394 3206.7758 3210.4594 3221.2031 3941.8156
redmass: 1.3401 3.1011 3.1725 3.3931 3.0367 3.3064 2.6735 2.0849 1.4266 1.3749 2.1350 3.4193 2.3664 2.4928 1.6886 1.5981 2.2913 2.8742 1.5946 3.0418 1.4256 2.1380 2.2053 4.3855 3.3205 2.5680 1.5620 2.2012 2.0415 2.6138 2.7137 1.4636 2.4209 1.2117 3.1760 1.4103 2.8215 1.4216 1.2978 1.3198 2.6669 1.4977 2.1453 1.2346 1.2139 1.2359 1.7216 1.6230 1.1921 1.5470 3.2386 3.6475 1.7941 3.8475 1.5837 2.6920 1.8010 1.1599 1.2516 1.4018 1.3279 1.0612 1.0732 1.1165 2.3624 8.3142 6.0951 5.7838 5.9569 1.0555 1.0544 1.0796 1.0817 1.1032 1.0994 1.0872 1.0870 1.0895 1.0887 1.0930 1.1007 1.0986 1.0989 1.0082
irintensity: 152.4828 0.3672 2.9018 0.0758 0.2695 3.1645 0.9322 0.8310 0.0776 1.2859 2.8222 2.1249 5.7034 15.3309 11.2863 20.5703 23.5775 5.5935 5.5247 16.2232 12.5517 4.5821 2.2519 9.8198 26.2449 80.8890 0.2210 64.0682 20.6380 21.7390 27.6727 0.6462 27.0395 17.8838 47.9873 1.0809 20.8245 1.8677 0.4751 0.1623 22.2023 12.7527 4.8337 14.4645 0.4575 10.4662 16.1673 10.5701 2.0145 10.9045 33.4702 82.4981 20.5474 19.2625 5.0254 28.7091 94.1592 1.3054 10.4976 7.2567 21.5382 14.3593 17.4215 5.0973 68.2104 25.1682 18.5433 2.9784 31.8291 91.2564 133.8420 46.2679 36.3255 24.2613 21.4279 9.3418 4.8635 50.5753 4.4606 26.1687 23.8053 24.6692 12.7485 231.9967
temp: 298.150 k
press: 1.00000 atm
elementType: 1 6 6 6 1 6 1 6 1 6 1 1 1 6 1 1 1 7 1 1 6 5 6 6 6 1 6 1 1 1
symmnumber: 1
zpe: 652622.8 jmol-1
zpe.correction: 0.248571 hartree
zpe.thermalcorrener: 0.262122 hartree
zpe.thermalcorrenthalpy: 0.263067 hartree
zpe.thermalcorrgfe: 0.208845 hartree
zpe.sumelectzpe: -546.128203 hartree
zpe.sumelectthermal: -546.114652 hartree
zpe.sumelectthermalent: -546.113707 hartree
zpe.sumelectthermalfe: -546.167929 hartree
dipole: 0.9421 -1.5672 0.3929
dipole: 1.8703
quadrupole: -72.6764 -82.1014 -86.8293
quadrupole: -7.4110 -0.1911 -0.8061
quadrupole: 7.8593 -1.5657 -6.2936 -7.4110 -0.1911 -0.8061
hfenergy: -546.376774 hartree
pointgroup: C01 [X(C12H16B1N1)]
dipole: 0.3706393 -0.6165939 0.1545882 debye
polarizability: 193.2759982|4.1610953|227.7385395|-16.6051073|-15.73565|140.3968457 unknown
InChI: InChI=1/C12H14BN.2H/c1-14(2)12-8-4-3-7-11(12)13-9-5-6-10-13;;/h3-10H,1-2H3;;
charge 0 multiplicity 1
30 atoms
H  0.30615713 0.43438023 0.38494469
C  1.38273891 0.31942338 0.32528559
C  2.19481922 1.43188451 0.14177024
C  1.9616052 -0.93670995 0.45472591
H  1.73790759 2.41433506 0.07224411
C  3.34259842 -1.07204633 0.38230215
H  1.34110631 -1.81217099 0.61267866
C  4.15398953 0.04141197 0.16902124
H  3.78932904 -2.0549903 0.48428782
C  6.02974675 -0.40680918 -1.26857035
H  5.53173207 0.23944222 -1.99079409
H  7.10947233 -0.25137041 -1.34464813
H  5.80714882 -1.45338239 -1.53482856
C  6.18781576 -0.95796041 1.07211934
H  5.99404161 -2.02740102 0.89106107
H  7.27098708 -0.81066417 1.05640124
H  5.81906039 -0.70101766 2.06681736
N  5.58140994 -0.08168016 0.08112722
H  5.65214611 2.60689295 1.16770946
H  5.85307577 1.94650817 0.81813697
C  3.58845173 1.32318357 0.05298609
B  4.43401131 2.63823726 -0.14921229
C  5.36531968 3.03872314 -1.38561609
C  3.98354741 4.06332229 0.42036882
C  5.3089321 4.37429084 -1.49336098
H  5.92101336 2.41816907 -2.07755048
C  4.48436677 4.98837278 -0.41134078
H  3.35256652 4.30180485 1.26925152
H  5.79326114 4.97289598 -2.25957548
H  4.33135613 6.0615353 -0.34063807
