program: Gaussian 16
title: cl_benzopiperidine
version: AS64L-G16RevC.02
method: RwB97XD
basis: GenECP
operation: Freq
keyword: #N
keyword: Geom=AllCheck
keyword: Guess=TCheck
keyword: SCRF=Check
keyword: GenChk
keyword: RwB97XD/GenECPFreq
converged: YES YES YES YES
title: Mulliken charges:
elementType: H C C C C H C H H B H H C N C C C H H C H H C H H H H H H Cl Cl
charge: 0.227986 -0.506453 -0.380605 -0.392270 0.799997 0.231052 -0.078167 0.241335 0.197469 -0.828538 0.232635 0.005290 -0.079788 0.096491 -0.094596 -0.265626 -0.436406 0.240225 0.174200 -0.369527 0.155584 0.209587 -0.501745 0.219493 0.174489 0.228068 0.166267 0.219336 0.144691 -0.001116 -0.029357
chargesum: -0.00000
title: Mulliken charges with hydrogens summed into heavy atoms:
elementType: C C C C C B C N C C C C C Cl Cl
charge: -0.278467 -0.149553 -0.150935 0.799997 0.119301 -0.595903 -0.079788 0.101781 0.319828 0.099545 -0.042424 0.024808 -0.137717 -0.001116 -0.029357
chargesum: 0.00000
1716.lowfreq: -811.4416 -6.0586 -0.0012 0.0010 0.0020 10.1217 14.6104 55.2319 67.8791
frequency: -811.4378 54.6513 67.7340 74.9433 84.3554 105.6171 175.3726 190.7918 217.7504 259.3655 262.1012 302.1663 340.7244 352.6086 403.5557 463.5819 481.6902 503.7884 512.7009 565.0141 595.0482 647.6697 656.6067 730.8519 765.7808 772.1359 793.5156 827.3077 838.2648 854.2096 862.5723 884.8243 903.4580 928.8334 935.3260 960.8166 983.7988 990.9355 1024.7127 1048.0453 1066.6935 1078.1210 1089.5250 1124.2020 1139.6047 1167.5333 1177.8347 1190.6074 1213.6137 1227.1635 1261.0888 1274.2910 1296.8039 1305.3915 1315.9407 1324.7765 1360.3999 1364.9852 1395.3811 1397.3369 1399.9601 1413.0885 1430.3385 1486.3981 1488.6903 1489.5144 1499.2202 1500.6367 1518.6254 1526.4510 1641.8657 1676.0785 2606.7354 3002.8133 3012.0078 3035.7874 3047.3799 3049.4972 3100.8206 3104.6895 3108.2938 3112.6343 3130.9683 3185.9141 3193.6438 3203.8927 3215.0742
redmass: 1.2563 7.6535 3.8948 4.8519 4.1972 5.1788 6.0923 5.5178 3.7617 3.5329 2.0982 5.1268 3.7964 3.0374 2.7829 3.0190 3.5474 3.1424 1.8139 3.3874 5.1136 3.6186 4.1945 1.7481 1.7700 3.0760 1.9665 1.4588 2.7826 2.4943 2.2210 1.3827 1.4919 2.6134 2.1009 2.0605 1.3349 1.3934 1.3224 2.7417 1.8822 2.0395 1.4610 2.1294 2.0664 1.2103 2.1134 1.1593 1.7407 1.5977 2.2776 1.8326 1.2463 1.6503 1.4505 2.5299 1.3306 1.4922 1.4790 1.4621 1.4040 1.1081 1.4773 1.0955 2.1456 1.1347 1.1021 1.0876 1.1174 2.5132 6.1956 6.2092 1.0220 1.0715 1.0690 1.0683 1.0645 1.0633 1.0953 1.0997 1.1016 1.0973 1.0938 1.0867 1.0894 1.0940 1.0990
irintensity: 2704.7163 0.3685 0.1122 1.4000 0.9946 0.6826 2.0123 12.9579 2.4157 0.1283 1.2265 1.5582 0.5911 7.2582 0.0765 0.8147 8.9622 7.5406 2.1799 21.7130 50.6590 14.6609 50.6124 76.3875 65.1073 6.0020 16.9430 0.3738 69.8226 138.1638 42.9926 4.0033 10.5727 82.8819 5.6135 45.3552 4.1683 0.9401 0.0304 19.1510 13.3549 3.2524 3.8563 13.1928 10.3729 2.2436 7.7957 1.6380 29.6214 39.6050 17.6286 11.3530 0.7734 13.0903 11.1568 18.7254 3.8529 18.0103 0.6979 3.0226 15.1308 63.1219 26.7195 4.4920 26.3012 19.0228 18.9030 6.3031 16.1838 32.7856 13.3322 21.5218 2308.9084 21.2250 29.6225 30.4195 16.9055 40.0149 53.6525 40.2955 37.8315 26.1678 9.4694 1.6099 2.9523 21.3391 18.7559
temp: 298.150 k
press: 1.00000 atm
elementType: 1 6 6 6 6 1 6 1 1 5 1 1 6 7 6 6 6 1 1 6 1 1 6 1 1 1 1 1 1 17 17
symmnumber: 1
zpe: 666173.7 jmol-1
zpe.correction: 0.253732 hartree
zpe.thermalcorrener: 0.267488 hartree
zpe.thermalcorrenthalpy: 0.268432 hartree
zpe.thermalcorrgfe: 0.212399 hartree
zpe.sumelectzpe: -1428.599663 hartree
zpe.sumelectthermal: -1428.585907 hartree
zpe.sumelectthermalent: -1428.584963 hartree
zpe.sumelectthermalfe: -1428.640996 hartree
dipole: 4.3957 -5.8830 -0.2538
dipole: 7.3482
quadrupole: -97.0301 -114.5293 -109.2081
quadrupole: 7.4363 3.0209 -0.2107
quadrupole: 9.8924 -7.6068 -2.2856 7.4363 3.0209 -0.2107
hfenergy: -1428.8533953 hartree
pointgroup: C01 [X(C11H16B1Cl2N1)]
dipole: 1.7294128 -2.3145456 -0.0998415 debye
polarizability: 226.4118105|-4.965323|216.1612952|-5.9763308|8.5583485|156.7838394 unknown
InChI: InChI=1/C11H14BCl2N.2H/c13-12(14)10-6-2-3-7-11(10)15-8-4-1-5-9-15;;/h2-3,6-7H,1,4-5,8-9H2;;
charge 0 multiplicity 1
31 atoms
H  -4.31723145 -1.6063664 -0.31541983
C  -3.26644987 -1.35273591 -0.23322387
C  -2.88763676 -0.0377224 -0.00142256
C  -2.29908535 -2.34533045 -0.35225273
C  -1.54083674 0.32167679 0.10461664
H  -3.65035238 0.72629393 0.10713315
C  -0.95500813 -2.01674566 -0.24484003
H  -2.59065239 -3.37417673 -0.53019527
H  -0.19825141 -2.78748731 -0.33953487
B  -1.10927969 1.82415646 0.36071598
H  0.24715169 1.80948541 1.07037276
H  0.50553433 1.07344719 0.68379555
C  -0.58478648 -0.69353349 -0.02689401
N  0.79887238 -0.30148895 0.07820368
C  1.6007218 -1.08788002 1.03044256
C  1.46333894 -0.16321123 -1.23393058
C  2.95290295 -0.41925439 1.25044313
H  1.03762319 -1.15587379 1.9635006
H  1.74782001 -2.10849224 0.64977146
C  2.81328431 0.52156767 -1.07287848
H  0.80395121 0.41583022 -1.88149496
H  1.58695923 -1.16153101 -1.67960856
C  3.69261323 -0.22887809 -0.07338395
H  3.54107062 -1.02845443 1.94141695
H  2.79720024 0.5533046 1.73096238
H  3.29845642 0.58294038 -2.05022781
H  2.64983671 1.54978857 -0.73034843
H  4.63044244 0.30797869 0.08895483
H  3.95377584 -1.21116065 -0.48645549
Cl -0.71668205 2.81843051 -1.13107659
Cl -2.04376959 2.73848232 1.63268614
