program: Gaussian 16
title: cl_biphenylene
version: AS64L-G16RevC.02
method: RwB97XD
basis: GenECP
operation: Freq
keyword: #N
keyword: Geom=AllCheck
keyword: Guess=TCheck
keyword: SCRF=Check
keyword: GenChk
keyword: RwB97XD/GenECPFreq
converged: YES YES NO YES
title: Mulliken charges:
elementType: C C C C C C C H C H H C H C H C C H B N C H H H C H H H H H Cl Cl
charge: 0.426448 0.205528 -0.093977 -0.273375 -0.435777 -0.170923 -0.189233 0.213066 -0.518382 0.244135 0.207671 -0.519236 0.220725 -0.348672 0.237677 -0.130817 0.678972 0.234836 -0.851499 0.110607 -0.384635 0.182307 0.215520 0.198060 -0.346189 0.200673 0.179094 0.225465 0.263021 -0.004849 0.003905 0.019852
chargesum: 0.00000
title: Mulliken charges with hydrogens summed into heavy atoms:
elementType: C C C C C C C C C C C C B N C C Cl Cl
charge: 0.426448 0.205528 -0.093977 -0.273375 -0.222711 -0.170923 0.054901 -0.310711 -0.298511 -0.110994 0.104019 0.678972 -0.856347 0.373628 0.211251 0.259043 0.003905 0.019852
chargesum: -0.00000
1716.lowfreq: -822.6970 -0.0011 0.0008 0.0018 6.2449 10.1858 13.6708 37.4968 68.7566
frequency: -822.6885 36.7527 68.5445 83.7235 100.2770 104.4538 142.7462 154.2937 168.9666 185.7469 225.0478 244.4968 256.9409 288.7966 297.6203 309.1393 353.9499 370.0615 396.1117 464.4716 468.2154 513.6014 561.1281 568.7974 602.4706 618.7995 651.2523 657.0146 675.7439 735.8461 741.9094 747.8900 783.0491 792.1966 817.0383 839.0617 846.4056 932.4931 932.8363 944.3145 968.4260 1000.1734 1005.0560 1006.7194 1010.2161 1053.2791 1063.0803 1074.7034 1118.1338 1154.6291 1163.0866 1184.7685 1187.3121 1199.0914 1210.6241 1221.9904 1249.6358 1252.2064 1264.9113 1313.1553 1338.4332 1378.7394 1411.5584 1441.5856 1449.4310 1475.9812 1484.5487 1495.4470 1499.2436 1502.2768 1505.0867 1520.3915 1523.9244 1662.8159 1672.6678 1694.2928 1758.9320 2357.3609 3035.7336 3043.0697 3124.5220 3127.0660 3157.3353 3167.8536 3185.8488 3191.1268 3201.3503 3205.9826 3215.6032 3219.3031
redmass: 1.3425 5.6140 9.4038 5.3063 3.4433 7.6567 3.6044 3.5575 4.6946 9.4297 1.0588 1.3367 4.9623 2.5303 3.8612 4.9808 4.4857 5.0422 4.8730 4.2582 3.3238 4.7784 3.4585 4.4015 4.5319 4.4192 4.6788 4.1336 2.7028 2.0894 2.7548 5.9043 1.5456 1.8653 3.2172 4.8209 4.0224 1.6948 2.6602 1.3986 2.0251 1.3278 2.3246 1.4443 2.3326 2.4041 1.5969 1.8557 1.2414 1.9734 2.2510 1.6275 1.8386 1.4307 1.6673 2.6421 2.5471 2.0258 1.4823 2.6533 1.9178 1.3020 2.3559 2.6038 1.1566 1.1881 1.0416 1.0709 1.4915 1.9314 1.2460 1.3609 6.4376 7.9599 7.6614 9.0879 9.4030 1.0344 1.0403 1.0375 1.1002 1.0964 1.1054 1.1052 1.0871 1.0872 1.0930 1.0934 1.0964 1.0964
irintensity: 3776.6157 1.1743 0.7404 3.4218 2.6657 3.1910 6.2621 10.4316 0.5339 10.5072 0.2105 7.4175 1.6092 1.3470 1.5833 2.4296 0.1046 0.8574 8.1131 0.0239 2.0994 8.3463 4.3879 29.7816 8.6790 26.2023 6.9396 15.6177 17.0819 41.7930 17.0940 2.3810 0.2100 256.6337 35.9538 28.9840 46.2225 21.1759 69.3122 3.2695 45.8180 1.2682 101.4138 5.5517 50.8407 9.6376 8.7422 21.9998 3.4357 41.5368 25.5000 38.7771 1.5987 11.0912 15.7970 14.4722 49.3741 14.9965 13.9855 32.8592 14.2969 63.2458 12.7123 33.4227 2.4412 2.3008 4.5035 10.9271 3.6030 3.9311 29.8120 49.2856 0.0892 3.1958 13.0898 20.7405 3.0590 3625.6372 26.6003 32.7062 15.3843 14.9294 11.5772 10.6775 1.2231 2.6811 15.5016 10.5484 22.0743 15.7930
temp: 298.150 k
press: 1.00000 atm
elementType: 6 6 6 6 6 6 6 1 6 1 1 6 1 6 1 6 6 1 5 7 6 1 1 1 6 1 1 1 1 1 17 17
symmnumber: 1
zpe: 642579.6 jmol-1
zpe.correction: 0.244746 hartree
zpe.thermalcorrener: 0.260850 hartree
zpe.thermalcorrenthalpy: 0.261794 hartree
zpe.thermalcorrgfe: 0.200863 hartree
zpe.sumelectzpe: -1541.617606 hartree
zpe.sumelectthermal: -1541.601502 hartree
zpe.sumelectthermalent: -1541.600557 hartree
zpe.sumelectthermalfe: -1541.661489 hartree
dipole: -7.3059 2.7478 -0.5866
dipole: 7.8275
quadrupole: -109.9455 -117.6660 -126.9718
quadrupole: 18.2313 0.7475 1.8375
quadrupole: 8.2489 0.5285 -8.7774 18.2313 0.7475 1.8375
hfenergy: -1541.8623515 hartree
pointgroup: C01 [X(C14H14B1Cl2N1)]
dipole: -2.8743517 1.0810751 -0.2307968 debye
polarizability: 343.6477555|-11.1820269|265.665159|-9.6077452|1.5633284|156.0354348 unknown
InChI: InChI=1/C14H12BCl2N.2H/c1-18(2)12-8-4-6-10-9-5-3-7-11(15(16)17)13(9)14(10)12;;/h3-8H,1-2H3;;
charge 0 multiplicity 1
32 atoms
C  0.85965615 0.59283517 -0.05757321
C  0.93875945 2.00198218 -0.02119124
C  -0.57663413 2.07909474 0.01820109
C  -0.63133786 0.66623111 -0.03024225
C  -1.71118998 2.83666321 0.08022444
C  -1.79640454 -0.0342855 -0.02820728
C  -2.93427333 2.11581964 0.09144934
H  -1.70809737 3.91897458 0.11987968
C  -2.98452085 0.73518899 0.04099628
H  -3.86587567 2.66811391 0.14031781
H  -3.94914222 0.2394823 0.05243174
C  2.14562855 2.64386631 -0.02986262
H  2.25671111 3.72114153 -0.00358477
C  3.27940821 1.79507366 -0.07877565
H  4.26617133 2.24472337 -0.09243536
C  3.17847269 0.41341237 -0.10920377
C  1.92659575 -0.26086665 -0.0943856
H  4.09055421 -0.17316156 -0.14749743
B  1.7489652 -1.83144401 -0.04575004
N  -1.77004431 -1.47836393 -0.08517476
C  -2.15595932 -2.10272763 1.19002282
H  -3.21496504 -1.92683115 1.41045496
H  -1.97429102 -3.17653869 1.12556919
H  -1.54272096 -1.68815083 1.98891262
C  -2.51955246 -2.02678136 -1.22326206
H  -2.32212992 -3.09838864 -1.28707847
H  -3.59748412 -1.87024548 -1.11254991
H  -2.17767961 -1.54651008 -2.14041703
H  -0.3472775 -1.83738493 -0.4077848
H  0.42404041 -2.08305961 -0.75912064
Cl 1.49823291 -2.54559844 1.6230352
Cl 2.82259651 -2.82953367 -1.1264569
