program: Gaussian 16
title: cl_dibenzofuran
version: AS64L-G16RevC.02
method: RwB97XD
basis: GenECP
operation: Freq
keyword: #N
keyword: Geom=AllCheck
keyword: Guess=TCheck
keyword: SCRF=Check
keyword: GenChk
keyword: RwB97XD/GenECP
keyword: Freq
converged: YES YES NO YES
title: Mulliken charges:
elementType: C C O C C C C C H C H H C H C H C C H B N C H H H C H H H H H Cl Cl
charge: -1.670576 0.856006 0.053454 0.613270 -0.789431 -0.028046 0.094923 -0.292369 0.232637 -0.549125 0.245722 0.207119 -0.328963 0.223053 -0.464353 0.234584 0.135601 1.168545 0.226562 -0.643735 0.006412 -0.382359 0.204975 0.219025 0.249883 -0.398401 0.202153 0.201123 0.229205 0.120891 0.006717 -0.070172 -0.114331
chargesum: -0.00000
title: Mulliken charges with hydrogens summed into heavy atoms:
elementType: C C O C C C C C C C C C C B N C C Cl Cl
charge: -1.670576 0.856006 0.053454 0.613270 -0.789431 0.204591 0.094923 -0.046647 -0.342006 -0.105910 -0.229768 0.362163 1.168545 -0.637019 0.127303 0.291524 0.234081 -0.070172 -0.114331
chargesum: 0.00000
1716.lowfreq: -1465.5396 0.0017 0.0022 0.0026 6.0251 12.0433 13.2815 53.5590 76.8868
frequency: -1465.5395 53.5017 76.8048 101.4664 107.5100 124.7691 137.7990 167.7245 183.4341 203.4050 232.9117 256.8953 275.2427 290.5165 292.0054 316.1865 343.2819 371.8685 411.3673 436.2696 458.0220 519.6238 555.6846 568.0313 573.5208 591.8772 609.1842 639.7545 665.2111 685.9893 694.4784 759.3393 763.7166 783.9309 805.7325 810.2934 826.7980 873.3883 898.4086 899.7540 913.2074 926.7326 934.7643 962.3239 996.2641 1003.9820 1022.4098 1062.9694 1077.9303 1081.7675 1116.5849 1146.9340 1188.4469 1191.4930 1200.5644 1211.4736 1225.6073 1260.3624 1274.6463 1297.1102 1303.9081 1326.3977 1344.1616 1370.1847 1428.5013 1447.0791 1452.3177 1466.4906 1477.5478 1484.9389 1491.9302 1495.8628 1496.5790 1514.3280 1519.7699 1526.0403 1534.8124 1641.7030 1652.8258 1664.7091 1698.1396 3060.0657 3062.0949 3148.4696 3151.4620 3172.4965 3185.0992 3190.5078 3201.2269 3202.5713 3214.4365 3214.9370 3224.6619
redmass: 1.1620 6.0407 10.3759 5.0157 7.3126 4.8593 3.1655 4.7156 4.7064 3.8094 1.1824 4.8447 1.2767 3.5958 5.3959 3.2430 6.4539 5.2461 3.8667 4.0458 4.0693 4.3723 5.1879 3.7840 5.4904 4.7005 4.9365 4.7104 5.8327 4.8438 6.1236 1.8470 3.3355 1.5851 3.5503 3.0117 3.4407 4.2593 3.7146 2.2145 1.4801 2.1761 1.5082 1.8859 1.3219 1.3350 2.1607 1.6580 1.9893 1.8971 1.2506 3.1395 1.2855 1.3723 1.4992 2.0043 3.5943 2.9689 2.0340 2.7630 1.8898 3.1805 4.4112 3.8927 1.2170 2.1437 1.2702 1.1510 1.6769 1.2980 1.1128 1.1124 1.2918 1.1011 1.2196 2.7832 2.1495 7.2788 6.8234 8.3366 9.1749 1.0353 1.0351 1.1033 1.1039 1.1063 1.1052 1.0871 1.0877 1.0919 1.0965 1.0933 1.0960
irintensity: 9970.3948 1.3465 0.9512 10.0575 1.3195 1.6705 2.9134 4.0692 0.6530 4.6981 2.4936 0.6006 2.1566 2.9153 1.3865 0.8739 0.3084 2.8723 3.0166 12.4014 11.3829 19.1846 0.6014 11.0683 13.2267 11.8027 5.1744 30.1852 18.8694 45.2112 10.9823 25.9153 118.1412 104.7510 6.1033 39.4641 52.7992 11.8105 43.7547 108.3119 19.2108 95.6298 0.3650 72.3352 2.4496 3.2036 43.2402 11.5794 3.8292 28.0530 1.1046 65.1343 3.9757 23.1573 39.2110 4.8604 11.8078 79.8320 28.9175 106.0227 9.9227 39.5254 33.9364 5.1563 58.9271 74.7872 9.0322 261.4755 57.6603 13.2656 158.8555 255.9952 102.4902 6.2930 14.7915 211.4605 54.3993 28.0578 13.4626 22.3814 23.6739 20.8182 30.7657 9.3374 7.9059 7.0912 4.3709 1.3072 3.3773 7.8225 18.0296 12.0528 6.4993
temp: 298.150 k
press: 1.00000 atm
elementType: 6 6 8 6 6 6 6 6 1 6 1 1 6 1 6 1 6 6 1 5 7 6 1 1 1 6 1 1 1 1 1 17 17
symmnumber: 1
zpe: 656914.5 jmol-1
zpe.correction: 0.250206 hartree
zpe.thermalcorrener: 0.266332 hartree
zpe.thermalcorrenthalpy: 0.267276 hartree
zpe.thermalcorrgfe: 0.207011 hartree
zpe.sumelectzpe: -1616.854954 hartree
zpe.sumelectthermal: -1616.838827 hartree
zpe.sumelectthermalent: -1616.837883 hartree
zpe.sumelectthermalfe: -1616.898148 hartree
dipole: 9.6112 3.6925 1.5365
dipole: 10.4101
quadrupole: -117.2121 -124.7348 -131.8715
quadrupole: -22.8641 3.7523 2.8699
quadrupole: 7.3940 -0.1287 -7.2653 -22.8641 3.7523 2.8699
hfenergy: -1617.105159 hartree
pointgroup: C01 [X(C14H14B1Cl2N1O1)]
dipole: 3.78133 1.4527534 0.6044879 debye
polarizability: 328.9066298|9.7551994|274.848118|-4.6236606|7.992475|170.9353249 unknown
InChI: InChI=1/C14H13BCl2NO.H/c1-18(2)12-8-4-6-10-9-5-3-7-11(15(16)17)13(9)19-14(10)12;/h3-8,18H,1-2H3;
charge 0 multiplicity 1
33 atoms
C  -1.15131441 0.48232875 -0.63942813
C  -0.8796894 1.84188997 -0.44528379
O  -0.03510842 -0.1934166 -1.03268881
C  0.59743397 1.91742525 -0.4374465
C  0.98391907 0.5943672 -0.64972949
C  1.57413158 2.77281532 0.0725366
C  2.08618442 -0.00489282 -0.08222462
C  2.80416367 2.22864554 0.44778956
H  1.36689019 3.8195122 0.26045598
C  3.0490532 0.84720624 0.44665512
H  3.56332005 2.88449362 0.85703785
H  3.94618021 0.4638031 0.91679498
C  -1.92767671 2.62038144 0.03893641
H  -1.81197683 3.68395987 0.21200247
C  -3.11182444 1.97145993 0.39759613
H  -3.93273646 2.56128618 0.78931545
C  -3.22168873 0.57512191 0.4003076
C  -2.19594401 -0.23724015 -0.10014907
H  -4.08890712 0.11751169 0.86403651
B  -1.88049065 -1.78089651 0.1901018
N  1.91860249 -1.43617001 0.13769678
C  2.16936812 -2.25457311 -1.0707722
H  3.22858888 -2.21502041 -1.33715735
H  1.87711254 -3.28285951 -0.85746319
H  1.56062583 -1.8789498 -1.89008335
C  2.65567359 -1.94770248 1.30418029
H  2.33083916 -2.97199712 1.48703217
H  3.73354663 -1.94018152 1.12379415
H  2.42010744 -1.33579679 2.17405788
H  0.58688199 -1.62725088 0.41807113
H  -0.39554424 -1.79559881 0.64919985
Cl -2.74301631 -2.48800203 1.64111844
Cl -1.8375261 -2.90986243 -1.2600438
