program: Gaussian 16
title: Me_Cl-TS1
version: ES64L-G16RevC.01
method: RwB97XD
basis: GenECP
operation: Freq
keyword: #N
keyword: Geom=AllCheck
keyword: Guess=TCheck
keyword: SCRF=Check
keyword: GenChk
keyword: RwB97XD/GenECP
keyword: Freq
converged: YES YES YES YES
title: Mulliken charges:
elementType: H C C C C H C H C H B C H H H C H H H N H H Cl Cl
charge: 0.227692 -0.478120 -0.275423 -0.412406 0.754652 0.226595 -0.105294 0.234114 -0.161656 0.190879 -0.701506 -0.391411 0.120435 0.191935 0.168573 -0.362648 0.144136 0.173261 0.203518 -0.009711 0.106486 0.117738 0.005439 0.032721
chargesum: -0.00000
title: Mulliken charges with hydrogens summed into heavy atoms:
elementType: C C C C C C B C C N Cl Cl
charge: -0.250428 -0.048828 -0.178292 0.754652 0.085584 -0.161656 -0.595020 0.089533 0.158267 0.108028 0.005439 0.032721
1716.lowfreq: -455.8334 -7.7045 -0.0019 -0.0016 0.0007 4.4599 8.4632 57.9819 68.1484
frequency: -455.8331 57.9756 68.1392 97.9234 130.6540 154.8936 191.8118 224.7132 248.3649 255.2530 276.5965 344.8162 356.3938 380.5866 464.0515 491.9654 539.0790 559.4690 576.7328 587.2966 623.8704 674.6478 766.9875 770.4419 803.4601 850.0135 862.6987 896.3599 909.0285 979.5082 991.6561 1025.1163 1073.6706 1080.2581 1107.2805 1127.2722 1136.9894 1183.8744 1193.4186 1203.2026 1233.8646 1245.6943 1301.1610 1320.4083 1346.0554 1448.0587 1472.2720 1483.7251 1485.0663 1498.0294 1502.2346 1520.5891 1532.1698 1639.1416 1671.9947 2989.8889 2999.2309 3091.2268 3095.1544 3139.4244 3158.5019 3186.8455 3193.8361 3204.7454 3215.2649 3640.0472
redmass: 1.4974 6.7315 3.9883 3.6449 4.1837 3.8943 6.5267 1.7020 2.6273 1.2108 2.1469 3.9285 3.3637 4.6327 2.5598 2.2607 1.8701 1.7087 2.9575 3.2198 1.8887 2.7971 4.5280 1.8941 2.1240 2.4726 1.3872 5.7387 1.5707 3.2146 1.3879 1.3239 1.5145 2.2397 1.1920 1.3644 1.5353 1.6597 1.1493 1.6279 2.7819 3.9039 1.7868 4.1040 2.6466 1.1555 1.2434 1.3119 1.3902 1.0539 1.0823 1.1103 2.4008 6.1652 5.9547 1.0513 1.0486 1.0861 1.0858 1.1041 1.1013 1.0861 1.0897 1.0937 1.0990 1.0093
irintensity: 521.9275 1.3314 0.4259 0.1019 1.7769 3.6928 5.1348 0.5172 1.9286 0.3012 0.6341 1.6976 1.7604 1.4062 19.6851 11.7779 4.6179 3.5898 43.4920 75.1053 31.6684 33.7854 17.9783 97.2181 6.6118 196.7857 140.1501 131.3233 18.2519 38.0379 0.6954 0.0582 13.2440 5.5891 11.1676 12.3317 17.9119 11.6144 0.9069 7.4863 103.1319 31.6778 15.1529 25.2056 22.7382 1.4152 10.3064 7.6197 14.7025 15.1911 26.0883 8.2472 65.1379 19.3655 31.8957 96.6832 102.8228 34.6406 31.6960 21.2612 13.0092 1.0708 3.7972 20.6029 18.7861 1078.3325
temp: 298.150 k
press: 1.00000 atm
elementType: 1 6 6 6 6 1 6 1 6 1 5 6 1 1 1 6 1 1 1 7 1 1 17 17
symmnumber: 1
zpe: 489757.8 jmol-1
zpe.correction: 0.186539 hartree
zpe.thermalcorrener: 0.198955 hartree
zpe.thermalcorrenthalpy: 0.199899 hartree
zpe.thermalcorrgfe: 0.147478 hartree
zpe.sumelectzpe: -1311.920794 hartree
zpe.sumelectthermal: -1311.908378 hartree
zpe.sumelectthermalent: -1311.907434 hartree
zpe.sumelectthermalfe: -1311.959855 hartree
dipole: 0.6130 -4.6104 1.4493
dipole: 4.8715
quadrupole: -73.0464 -98.6114 -90.9057
quadrupole: -21.5411 8.1475 1.7082
quadrupole: 14.4748 -11.0902 -3.3845 -21.5411 8.1475 1.7082
hfenergy: -1312.1073332 hartree
pointgroup: C01 [X(C8H12B1Cl2N1)]
dipole: 0.2411711 -1.8138684 0.5701954 debye
dipolederiv: -0.1133546 0.0082764 0.0030244 0.0185757 0.0823526 0.0148058 0.0021691 0.0194632 0.1530143 0.0693131 -0.0399397 0.0079368 0.021545 -0.1634573 -0.0013908 -0.0012441 -0.0055933 -0.1315163 0.0292925 0.0474498 -0.0170469 -0.1342363 0.0646022 -0.0263496 -0.0201301 -0.0709507 -0.1159154 0.0914572 0.0158543 -0.008051 0.0073007 0.0861076 -0.0424859 0.0036271 -0.0455953 -0.1365758 -0.4834421 -0.1313796 0.0507137 -0.0391932 -0.5984862 0.046664 -0.0014952 0.0629886 -0.2743601 0.0702318 0.063172 -0.0043983 0.0841891 -0.0353358 0.0329202 -0.00366 0.0340144 0.121801 -0.2901953 0.003836 0.0139659 -0.1552873 -0.0307366 -0.025375 0.09063 -0.0521837 -0.1153964 0.0086586 -0.0858264 0.020778 -0.1019478 -0.0329036 0.0379601 0.0123469 0.0478577 0.1392317 0.8738692 -0.2293293 0.0031831 -0.0685738 0.273839 -0.0239934 -0.0446471 0.0197168 -0.1025752 0.0674389 0.0853813 -0.0126872 0.071619 -0.0465841 0.0392668 -0.0132078 0.0390653 0.1386387 1.348847 -0.1400374 -0.3688125 -0.0051085 1.8279902 0.1149665 -0.3261845 -0.0856633 1.7126208 0.2342567 -0.0369398 -0.1639733 0.0188321 0.3444439 0.158963 -0.3064133 0.2971773 0.3531472 0.0597624 0.0407262 -0.0630246 0.0304538 0.0593692 0.0750953 -0.0335826 0.0308642 -0.0361493 -0.1936372 0.0205878 0.0470888 -0.0210043 0.0670477 -0.032558 -0.0019535 -0.0329562 0.0601276 0.0341604 -0.0870652 0.010032 0.0166641 -0.2422996 -0.1132166 0.0601693 -0.0095262 0.0133339 0.1897159 -0.0514429 0.1535382 -0.1227161 0.4609058 -0.1418368 0.2506262 -0.2604628 0.3565235 0.0518868 -0.0825862 -0.0214801 0.0165234 -0.2452689 0.0746149 -0.0547837 -0.0274995 0.006295 -0.1883093 0.0242212 -0.0530855 -0.027741 0.0588498 0.025575 0.0054847 0.0313037 0.0743064 0.0699393 0.0319086 0.0919418 0.0442336 0.0282386 -0.0670828 0.0344366 -0.0197196 -0.0764307 -0.7587505 0.1351787 0.0079382 0.2006281 -1.0743464 -0.008905 0.0878612 -0.1243845 -0.5201273 -0.2254973 0.2006138 -0.1348362 0.1848793 -0.4692428 0.1253204 -0.1079828 0.0784322 -0.1024702 -0.1008363 0.0463955 -0.0934152 -0.1512601 1.0709926 -0.0360845 -0.1295279 0.2295366 -0.0942752 -0.4919565 -0.1322187 0.4173302 -0.0719568 -0.3873904 0.0861301 0.3621009 0.1727395 -0.9717888 -0.3528505 0.2931639 0.1133398 0.1835811 -1.0986876 -0.3130036 0.1353607 -0.3286243 -0.4514595 unknown
polarizability: 177.3628582|-1.8893942|187.0699752|-8.5817964|-9.1088359|125.074059 unknown
InChI: InChI=1/C8H10BCl2N.2H/c1-12(2)8-6-4-3-5-7(8)9(10)11;;/h3-6H,1-2H3;;
charge 0 multiplicity 1
24 atoms
H  0.32419881 0.46148979 0.12372235
C  1.40114172 0.33894115 0.12967053
C  2.22457781 1.43331246 -0.09194102
C  1.96368818 -0.90856844 0.37157717
C  3.61981155 1.31103922 -0.09820352
H  1.77554711 2.40696062 -0.25693779
C  3.34366549 -1.05318062 0.37970298
H  1.32948135 -1.76905634 0.55304853
C  4.1717322 0.0406967 0.13522422
H  3.78047008 -2.02742784 0.5685501
B  4.48467604 2.59671405 -0.37760181
C  6.12463864 -0.60782825 -1.13194705
H  5.71600536 -0.02985614 -1.96004006
H  7.21254272 -0.50598944 -1.13970089
H  5.86829666 -1.66795239 -1.27897912
C  6.14251687 -0.82416701 1.27902887
H  5.93599801 -1.90342564 1.24184359
H  7.22671873 -0.68986495 1.29908232
H  5.7247738 -0.41855066 2.20195729
N  5.60250268 -0.096677 0.13522316
H  5.87300265 2.46771956 0.64488977
H  5.90418441 1.6981669 0.46563201
Cl 5.29498804 2.79360131 -1.97775533
Cl 3.99262545 4.14300013 0.40994804
