program: Gaussian 16
title: cl_indole
version: AS64L-G16RevC.02
method: RwB97XD
basis: GenECP
operation: Freq
keyword: #N
keyword: Geom=AllCheck
keyword: Guess=TCheck
keyword: SCRF=Check
keyword: GenChk
keyword: RwB97XD/GenECPFreq
converged: YES YES NO YES
title: Mulliken charges:
elementType: C C C C C C C C H H H N H B C H H H C H H H H H Cl Cl
charge: -0.240325 0.620408 -0.856783 -0.644928 0.610565 -0.463916 -0.400606 0.378346 0.180677 0.217554 0.221085 0.287549 0.283728 -0.533714 -0.414796 0.250925 0.153074 0.164583 -0.560179 0.206326 0.164328 0.173158 0.298924 0.015676 -0.057135 -0.054524
chargesum: -0.00000
title: Mulliken charges with hydrogens summed into heavy atoms:
elementType: C C C C C C C C N B C C Cl Cl
charge: -0.240325 0.904135 -0.856783 -0.464251 0.610565 -0.246363 -0.179521 0.378346 0.586473 -0.518038 0.153787 -0.016366 -0.057135 -0.054524
1716.lowfreq: -1495.2229 0.0004 0.0018 0.0027 1.6032 11.8402 22.8801 31.0756 57.3453
frequency: -1495.2227 30.3325 56.8121 61.9691 101.8188 152.2507 172.3392 189.3146 214.9360 223.5866 271.9408 304.5165 319.5287 355.7152 381.3717 442.5952 474.3900 531.3128 584.7688 606.6436 636.7230 663.0590 737.6153 748.9388 764.5014 785.3737 837.8862 844.6692 885.9160 902.2428 915.4464 929.6812 961.2529 993.8658 1023.4690 1052.5479 1065.7309 1088.2722 1107.6928 1156.4757 1165.9890 1169.7372 1208.1692 1242.9149 1269.1611 1302.9442 1317.2804 1367.9223 1406.4731 1419.2082 1463.7528 1473.7537 1490.0328 1498.2511 1502.5180 1508.1645 1540.5817 1628.7893 1661.1811 1692.9885 1705.7427 1778.2679 3046.8691 3073.4133 3114.7819 3137.2424 3166.7816 3185.3665 3187.4202 3198.6964 3211.0595 3249.5560
redmass: 1.1181 1.0468 6.6220 6.2374 5.1516 3.4095 4.0726 12.1017 1.4678 3.4436 2.4907 3.5824 4.9485 5.1330 3.5765 3.2642 4.3634 4.1221 5.0654 3.4903 4.7028 5.4403 3.3458 4.8431 3.6483 3.7127 3.4092 1.3839 2.7461 1.4550 1.5549 1.6901 2.5029 1.3463 1.4202 1.2611 1.5637 3.1211 3.9518 1.5166 1.5080 1.7152 1.4743 2.1518 2.6979 3.8492 1.6381 3.5218 1.2809 1.2707 1.3987 1.3601 1.0572 1.1484 1.0502 1.3574 3.1710 1.6611 3.1266 5.9148 3.3973 1.1003 1.0380 1.0332 1.0992 1.1033 1.1055 1.1059 1.0893 1.0924 1.0955 1.0975
irintensity: 6714.4417 0.3737 0.3184 0.4030 1.6949 2.2977 0.1387 6.9694 1.0595 1.6611 3.8535 3.7832 2.4144 1.1304 0.3427 12.2548 13.1258 6.6418 17.4038 21.4091 38.9545 30.7552 152.5386 11.5329 84.7112 9.9362 20.3884 23.4743 119.4238 56.4113 28.7992 149.4975 85.2116 1.3887 20.2969 95.1973 14.1567 8.5321 70.4318 17.8155 36.5202 5.4367 4.8993 15.7903 4.5328 23.3555 3.8504 0.8784 12.1912 1.0018 2.7937 3.8127 9.6097 8.9332 20.3140 40.0120 27.3548 82.8279 45.2925 146.9048 118.0471 483.4275 32.7401 21.6163 15.9022 16.1986 8.7686 1.3584 11.6916 6.0692 11.2458 1.9202
temp: 298.150 k
press: 1.00000 atm
elementType: 6 6 6 6 6 6 6 6 1 1 1 7 1 5 6 1 1 1 6 1 1 1 1 1 17 17
symmnumber: 1
zpe: 520151.3 jmol-1
zpe.correction: 0.198115 hartree
zpe.thermalcorrener: 0.211455 hartree
zpe.thermalcorrenthalpy: 0.212399 hartree
zpe.thermalcorrgfe: 0.156621 hartree
zpe.sumelectzpe: -1388.092419 hartree
zpe.sumelectthermal: -1388.079079 hartree
zpe.sumelectthermalent: -1388.078135 hartree
zpe.sumelectthermalfe: -1388.133914 hartree
dipole: -8.3697 -2.1769 -0.8877
dipole: 8.6936
quadrupole: -119.1220 -88.5566 -102.0708
quadrupole: -2.6861 -3.5466 -4.0129
quadrupole: -15.8722 14.6932 1.1790 -2.6861 -3.5466 -4.0129
hfenergy: -1388.2905341 hartree
pointgroup: C01[X(C10H12B1Cl2N1)]
dipole: -3.2928779 -0.8564426 -0.3492652 debye
dipolederiv: -0.9220582 0.2780285 0.0202429 0.1071728 0.014171 -0.1347092 0.2911837 -0.2359765 -0.2845935 0.1269839 0.1566168 -0.0969119 0.114554 0.1112321 -0.0460765 -0.2232136 0.061777 -0.1191398 0.7445373 -0.0986836 -0.0378956 -0.4352504 0.0797366 -0.0587923 -0.127639 -0.0577727 -0.0379621 -0.3297626 -0.0491219 0.0357695 0.0722855 0.0377069 -0.0498009 0.0035349 -0.0407736 -0.1127991 0.3392045 0.1531942 -0.1058964 0.1976898 0.0496496 -0.0699337 -0.1739228 -0.0908989 -0.0451185 -0.106953 -0.0875442 0.0163529 -0.3048816 -0.0721001 0.0101465 0.0882065 -0.0047514 -0.1636564 0.0739685 -0.0221722 -0.0094073 -0.0149976 0.1425232 -0.0871388 0.0323252 -0.0740747 -0.0961678 0.1487612 -0.0652016 0.0032219 0.1519629 -0.2240732 0.0486932 -0.0132035 0.0493851 -0.0003923 0.0985794 0.0076327 -0.0047759 -0.0164066 -0.0511327 0.05349 -0.0207296 0.0490923 0.1363502 -0.0896173 0.0897616 -0.0109464 0.0722035 0.057284 0.0186443 -0.014502 0.0181081 0.1440912 0.0790235 -0.0184137 0.0109466 0.0088807 -0.0592982 0.0622288 -0.0006311 0.0632691 0.1362749 -1.6228533 -0.1241733 -0.3280985 0.5667175 -0.6499276 0.0591618 -1.0178312 0.005475 -0.3515666 0.0463787 -0.0413519 0.0224381 -0.0490307 0.0139393 0.0247306 0.0140549 -0.0104261 0.1587571 2.0619873 -0.0429842 -0.1497087 0.2823017 1.519599 0.562542 -0.5185172 0.4370875 1.1123098 0.0793174 -0.0501463 -0.00039 -0.1013539 0.5161896 0.1463588 0.0042475 0.2134838 0.3103562 0.0863934 0.0041942 -0.0404535 0.0035156 0.0162219 0.0678436 -0.0330706 -0.047721 -0.0612951 0.0054408 0.0867403 0.0022531 0.030241 0.0758967 -0.0184567 -0.0201859 -0.0175039 0.0701232 0.0437599 -0.121257 0.0364538 -0.0528456 -0.0241092 0.0026511 0.0605076 0.0295588 0.0352654 -0.0387334 -0.0594981 0.0362077 0.0172238 0.1117165 0.0051979 0.1679985 0.0540272 0.0824722 -0.0464383 -0.0452984 0.047154 -0.0599194 0.0645325 -0.0429796 0.1036464 -0.0190495 -0.0876634 -0.08506 -0.0048873 -0.0448323 0.0303118 0.0361622 0.0710699 -0.1237627 0.0419776 0.0166611 0.0165332 0.0537231 0.017915 -0.0637658 -0.1354507 -0.00322 -0.0091227 -0.0313018 0.0892491 2.0734219 0.1417011 0.5276681 0.0190508 0.0233501 0.0069668 1.1136277 0.0653935 0.3227928 -1.0748492 -0.2367508 -0.0189131 -0.4179371 -0.300488 0.0582724 0.1969527 0.1478136 -0.2022108 -0.6856661 -0.2116503 -0.198397 -0.5177515 -0.7809126 -0.4130255 -0.248628 -0.3474342 -0.5225951 -1.0222995 0.3075425 0.270003 0.3600289 -0.572419 -0.2738646 0.4686745 -0.2587643 -0.5295429 unknown
polarizability: 276.6056916|-3.8600376|184.6546517|-1.836106|-3.651936|127.2144053 unknown
InChI: InChI=1/C10H12BCl2N/c1-7-3-4-8-6-10(11(12)13)14(2)9(8)5-7/h3-6,11,14H,1-2H3
charge 0 multiplicity 1
26 atoms
C  1.54826781 0.34787888 -0.26725129
C  0.789965 1.42720517 -0.50445162
C  -0.65940801 -0.26674717 0.05405635
C  -1.84006708 -0.9346939 0.31170797
C  -3.0363081 -0.22146688 0.20343318
C  -2.99812752 1.1256875 -0.17952565
C  -1.80455488 1.78219288 -0.45261076
C  -0.61561743 1.07085166 -0.34110325
H  -1.8481558 -1.97817379 0.60736911
H  -3.93299874 1.66943271 -0.26759702
H  -1.80365465 2.82341206 -0.75344465
N  0.67963188 -0.78413587 0.06901781
H  1.17001 2.42636359 -0.66335612
B  2.98412319 0.06983508 0.36718735
C  0.85619087 -2.00759876 -0.75213496
H  0.61213838 -1.78967807 -1.79296065
H  1.88914331 -2.3426288 -0.67980374
H  0.19684383 -2.78337625 -0.36611364
C  -4.35014146 -0.88311215 0.52679005
H  -4.64531125 -0.66874938 1.55856663
H  -5.1462636 -0.51871302 -0.12577233
H  -4.2875679 -1.96752959 0.41779248
H  1.53365523 -0.95434228 1.07042105
H  2.5025621 -0.87823146 1.38004819
Cl 3.71217866 1.45204525 1.30848066
Cl 4.21733731 -0.8673621 -0.61771582
