program: Gaussian 16
title: MeQHBCl2 TS1
version: ES64L-G16RevC.01
method: RwB97XD
basis: GenECP
operation: Freq
keyword: #N
keyword: Geom=AllCheck
keyword: Guess=TCheck
keyword: SCRF=Check
keyword: GenChk
keyword: RwB97XD/GenECP
keyword: Freq
converged: YES YES YES YES
title: Mulliken charges:
elementType: C C H C N N N B H H H H H Cl Cl
charge: -0.389317 0.026907 0.292384 -0.305370 0.253838 -0.356271 0.042276 -0.616473 0.341998 0.097250 0.216877 0.217076 0.205613 -0.013558 -0.013229
chargesum: -0.00000
title: Mulliken charges with hydrogens summed into heavy atoms:
elementType: C C C N N N B Cl Cl
charge: 0.250248 0.319291 -0.305370 0.253838 -0.356271 0.384274 -0.519223 -0.013558 -0.013229
1716.lowfreq: -1065.0265 -7.0379 -0.0008 0.0033 0.0038 0.5526 10.2822 64.2173 66.7586
frequency: -1065.0265 63.6876 66.7501 88.2742 174.8623 206.3381 219.1313 361.5647 363.5392 419.8574 637.1609 663.8957 694.9606 718.8547 726.7122 841.3158 864.0221 865.4476 1062.9754 1077.5083 1083.9597 1120.2413 1125.4762 1157.1585 1180.4492 1324.0511 1352.1525 1389.2832 1454.3995 1486.4980 1488.4513 1516.9392 1612.5543 1712.7578 2122.3752 3083.8934 3170.6858 3198.2072 3301.5217
redmass: 1.1705 1.0532 6.9448 7.5948 6.5649 3.9378 9.4125 6.0910 7.3848 5.3958 4.3639 3.0864 1.4685 4.6346 8.5235 1.5650 5.9819 3.1004 1.5874 1.8206 4.6510 2.5799 1.0295 1.3230 1.6658 5.8481 5.0633 4.9070 1.4012 1.6235 1.1982 1.4288 5.0811 1.0875 1.0461 1.0328 1.1071 1.1055 1.1023
irintensity: 3295.8169 0.0157 0.6039 9.0733 3.6978 0.7805 2.9689 7.3841 2.9677 3.2756 58.9719 10.6708 69.8209 33.2733 29.8574 167.6723 264.3358 151.9928 18.5071 7.2664 16.1449 94.4569 12.9140 0.6530 99.6292 17.1245 34.5088 0.8593 6.9032 21.2523 17.8748 7.1193 9.2805 140.8585 1211.1317 18.8511 4.3213 0.3633 5.1299
temp: 298.150 k
press: 1.00000 atm
elementType: 6 6 1 6 7 7 7 5 1 1 1 1 1 17 17
symmnumber: 1
zpe: 263166.0 jmol-1
zpe.correction: 0.100235 hartree
zpe.thermalcorrener: 0.109102 hartree
zpe.thermalcorrenthalpy: 0.110046 hartree
zpe.thermalcorrgfe: 0.064343 hartree
zpe.sumelectzpe: -1227.330428 hartree
zpe.sumelectthermal: -1227.321561 hartree
zpe.sumelectthermalent: -1227.320617 hartree
zpe.sumelectthermalfe: -1227.366319 hartree
dipole: 7.4068 2.4813 -1.0443
dipole: 7.8809
quadrupole: -79.2294 -81.5273 -74.2250
quadrupole: -17.6609 7.8611 3.6142
quadrupole: -0.9021 -3.2001 4.1022 -17.6609 7.8611 3.6142
hfenergy: -1227.4306625 hartree
pointgroup: C01 [X(C3H6B1Cl2N3)]
dipole: 2.9140755 0.9761993 -0.4108432 debye
dipolederiv: 0.6060324 0.1244546 -0.0395867 0.1465268 0.1980287 0.0211902 -0.0749073 0.0169276 0.2001393 0.1851155 -0.1623085 0.0948138 0.1747596 -0.0143599 -0.0080215 -0.0904921 -0.0199092 -0.0335091 0.0845309 0.0190582 -0.0130659 0.0138674 0.1306272 0.0342619 -0.0091198 0.0342076 0.1764845 -0.3364829 0.0958433 -0.0562877 -0.1642823 -0.4197405 0.0928134 0.0816317 0.0976859 -0.2878801 -0.7009239 -0.239142 0.1001196 -0.0853038 0.1636619 -0.120131 0.0473236 -0.1155249 0.004854 0.1707526 -0.1972259 0.113386 -0.096804 -0.3531538 0.1439236 0.055537 0.1345734 -0.1419298 -1.0912123 -0.3627812 0.1565361 -0.3819407 -0.1862378 -0.0129843 0.1712984 -0.0066688 -0.1654578 0.850411 0.109814 -0.0928128 0.503941 1.6959593 0.1478636 -0.2999649 0.1325777 1.8666358 1.2342652 0.9321145 -0.4507398 0.7111291 0.6849209 -0.2829377 -0.3366333 -0.2752227 0.2326976 -0.1994292 -0.0490148 0.020725 -0.3474159 -0.7141695 0.3328993 0.1775365 0.3426781 -0.2324172 0.0523425 0.0410595 -0.0333289 -0.0411907 0.0314828 0.055796 0.0189404 0.0605531 0.0821955 -0.0369147 -0.0462122 0.0197131 -0.0396498 0.0998513 -0.0018304 -0.0627213 -0.0269035 -0.0410646 -0.0307063 -0.0357126 0.023063 0.0487316 -0.0058724 -0.0697634 0.0515507 -0.0504193 0.0777475 -0.4069894 -0.0411206 0.2433127 -0.0957446 -0.3513373 0.0120081 0.3930851 0.0844758 -1.1585977 -0.3807915 -0.1888263 -0.0858475 -0.3466235 -0.959661 -0.345088 -0.1230647 -0.4090308 -0.5798979 unknown
polarizability: 123.8945284|19.0483726|109.1808069|-8.6749182|-9.2812437|94.6880342 unknown
InChI: InChI=1/C3H5BCl2N3.H/c1-9-2-3(4(5)6)7-8-9;/h2,4H,1H3;
charge 0 multiplicity 1
15 atoms
C  1.58529541 -0.0951576 -0.04782922
C  -0.29528374 -1.61992497 0.67508936
H  0.34879366 -2.37566806 1.09111828
C  -1.65772485 -1.50866935 0.57345498
N  0.19342958 -0.49324337 0.09951387
N  -0.77506954 0.29415843 -0.34363006
N  -1.87667833 -0.32646916 -0.0532973
B  -3.0520247 -2.19440849 0.88711779
H  -3.26136524 -0.56469607 0.02492981
H  -3.88965039 -1.18121456 0.32786492
H  1.60533782 0.81689816 -0.63917695
H  2.02075356 0.08923893 0.93378437
H  2.13564932 -0.88234483 -0.56143831
Cl -3.573039 -2.24776535 2.6311245
Cl -3.48400368 -3.67309307 -0.08378299
