program: Gaussian 16
title: cl_naphthalene
version: AS64L-G16RevC.02
method: RwB97XD
basis: GenECP
operation: Freq
keyword: #N
keyword: Geom=AllCheck
keyword: Guess=TCheck
keyword: SCRF=Check
keyword: GenChk
keyword: RwB97XD/GenECPFreq
converged: YES YES NO YES
title: Mulliken charges:
elementType: C C C C C C H C C H H C C H H H B N C H H H C H H H H H Cl Cl
charge: -0.419620 0.223077 -0.135666 0.261668 -0.208140 -0.573030 0.181396 0.509986 -0.204781 0.190629 0.236806 -0.549622 -0.049504 0.207085 0.240697 0.162274 -0.781574 -0.072576 -0.444107 0.200734 0.188244 0.209660 -0.307561 0.217567 0.149223 0.198014 0.241275 0.132901 -0.005982 0.000928
chargesum: -0.00000
title: Mulliken charges with hydrogens summed into heavy atoms:
elementType: C C C C C C C C C C B N C C Cl Cl
charge: -0.238224 0.223077 -0.135666 0.261668 -0.017511 -0.336224 0.509986 0.002304 -0.308924 0.112770 -0.648672 0.168699 0.154530 0.257243 -0.005982 0.000928
1716.lowfreq: -664.6693 -0.0021 0.0003 0.0007 5.0159 10.1192 16.3831 27.5992 80.1683
frequency: -664.6620 26.6164 79.8556 99.4499 128.9532 147.4127 169.7892 186.4003 203.6574 226.1765 232.7653 259.8019 286.4047 304.4746 329.4336 367.2974 421.8719 479.2310 487.6067 509.3711 518.9399 546.6342 580.8534 614.2326 652.9254 672.4911 684.4539 733.3641 780.3569 801.7844 803.3096 810.6188 840.0001 867.7363 928.2495 931.0907 938.2650 963.5784 1008.6643 1019.7964 1037.2154 1057.8691 1065.6461 1075.1700 1128.4369 1130.5118 1143.5316 1183.4935 1197.8654 1205.9417 1235.3828 1237.1516 1249.4396 1277.3966 1323.1018 1367.3910 1389.6292 1404.7883 1419.1847 1449.1676 1470.3442 1477.3580 1481.7551 1497.0109 1503.4645 1512.8294 1522.2735 1568.5881 1649.6221 1668.7648 1692.9591 2946.7907 3024.6182 3035.1549 3104.2180 3105.4002 3141.5461 3166.2443 3187.2702 3189.2192 3198.6972 3205.7173 3215.4872 3219.8309
redmass: 1.2756 4.8225 7.8315 5.3288 3.2352 4.6117 3.8650 3.3929 8.5549 3.9755 1.1259 1.1917 5.3909 3.5417 5.9388 4.1893 2.9039 3.6591 4.1885 4.7592 3.9969 5.6014 4.1351 3.9785 3.5474 2.1837 2.7320 2.6967 1.5143 1.7076 4.7310 3.8330 2.9279 3.2738 1.2229 3.1239 1.5344 1.4112 1.3325 1.3473 3.1461 3.5253 1.5956 1.1804 2.0083 1.8904 1.3152 1.3585 1.4393 1.3295 2.2775 1.9964 2.2164 1.9648 2.1004 2.8161 1.7831 2.3160 2.5714 1.1545 1.8094 1.2196 1.0527 1.0544 1.1633 1.6473 1.2439 4.3698 6.5566 5.2243 6.4251 1.0159 1.0390 1.0391 1.0986 1.0977 1.1039 1.1023 1.0876 1.0871 1.0914 1.0937 1.0982 1.0944
irintensity: 1680.5476 0.7203 0.3577 1.7153 1.0499 4.3039 9.2788 2.4061 4.6316 1.3850 0.0702 2.5746 1.9796 0.3480 3.8509 5.6983 4.4997 1.8901 3.3948 3.2122 7.3988 3.0366 40.2806 26.7189 52.8388 24.7689 11.0215 23.9666 14.1939 35.0691 33.8602 130.3602 138.0706 20.7704 178.0667 37.1340 41.2134 1.9347 0.3532 0.3288 73.7798 24.0670 25.4434 9.8863 1.6526 51.1375 25.4987 20.0745 47.4096 15.9766 5.8231 14.4201 13.8072 35.6336 2.2554 7.6838 20.7810 54.3970 29.3643 3.1234 3.1604 1.2841 3.8313 24.8584 15.2527 14.0295 34.2320 24.8788 2.4936 7.2716 2.3297 1888.5556 26.1942 68.3498 41.2973 7.1442 16.1087 8.7759 1.3289 1.1901 15.7196 17.5000 17.1385 11.2322
temp: 298.150 k
press: 1.00000 atm
elementType: 6 6 6 6 6 6 1 6 6 1 1 6 6 1 1 1 5 7 6 1 1 1 6 1 1 1 1 1 17 17
symmnumber: 1
zpe: 616121.0 jmol-1
zpe.correction: 0.234668 hartree
zpe.thermalcorrener: 0.249316 hartree
zpe.thermalcorrenthalpy: 0.250260 hartree
zpe.thermalcorrgfe: 0.192729 hartree
zpe.sumelectzpe: -1465.490300 hartree
zpe.sumelectthermal: -1465.475652 hartree
zpe.sumelectthermalent: -1465.474708 hartree
zpe.sumelectthermalfe: -1465.532240 hartree
dipole: -2.5991 -5.7043 2.0524
dipole: 6.5959
quadrupole: -106.6304 -103.0656 -115.5782
quadrupole: -14.2096 4.8984 2.0641
quadrupole: 1.7944 5.3591 -7.1535 -14.2096 4.8984 2.0641
hfenergy: -1465.7249686 hartree
pointgroup: C01 [X(C12H14B1Cl2N1)]
dipole: -1.0225456 -2.2442341 0.807474 debye
polarizability: 246.2019626|10.4625067|271.6782935|2.7557205|20.6863203|148.5375777 unknown
InChI: InChI=1/C12H12BCl2N.2H/c1-16(2)11-8-4-6-9-5-3-7-10(12(9)11)13(14)15;;/h3-8H,1-2H3;;
charge 0 multiplicity 1
30 atoms
C  -0.96017899 -2.28459798 -0.36894336
C  -0.12006446 -1.23295134 -0.09935597
C  -0.61505132 0.10373388 0.0093819
C  -2.03362775 0.258354 -0.04106509
C  -2.87215307 -0.8507282 -0.31066806
C  -2.3467534 -2.09663671 -0.50289658
H  -0.5538748 -3.28692062 -0.44619488
C  0.20760527 1.28026385 0.17229465
C  -2.61686968 1.53274118 0.18004234
H  -3.9437015 -0.68935063 -0.36186038
H  -2.98778051 -2.94297072 -0.71959742
C  -1.83176445 2.61616097 0.4335311
C  -0.42796406 2.481051 0.40660604
H  -3.69762426 1.62240841 0.1466309
H  -2.27235341 3.58885377 0.61944626
H  0.1688699 3.37534117 0.53762661
B  1.76248003 1.38588147 -0.16879966
N  1.26937093 -1.50594021 0.19499795
C  1.43074559 -2.03472942 1.55541109
H  0.991577 -3.03401415 1.65774516
H  2.49688229 -2.08959456 1.79135686
H  0.94725449 -1.36043622 2.26420068
C  1.96526418 -2.32995306 -0.79699985
H  3.03996826 -2.27077118 -0.60841554
H  1.66521733 -3.38367592 -0.7471562
H  1.76377627 -1.94030484 -1.79339283
H  2.0898445 -0.17162461 0.38805523
H  2.63705654 0.42019 0.6358316
Cl 2.17822384 1.0022336 -1.91648134
Cl 2.68382148 2.83439852 0.47667237
