program: Gaussian 16
title: cl_nmeimidazole
version: AS64L-G16RevC.02
method: RwB97XD
basis: GenECP
operation: Freq
keyword: #N
keyword: Geom=AllCheck
keyword: Guess=TCheck
keyword: SCRF=Check
keyword: GenChk
keyword: RwB97XD/GenECP
keyword: Freq
converged: YES YES YES YES
title: Mulliken charges:
elementType: C C H C N N B H H H H H C H Cl Cl
charge: -0.401990 -0.020328 0.275042 -0.180595 0.025221 -0.067336 -0.587731 0.278825 0.049569 0.215499 0.167714 0.215306 -0.170053 0.248443 -0.023790 -0.023794
chargesum: 0.00000
title: Mulliken charges with hydrogens summed into heavy atoms:
elementType: C C C N N B C Cl Cl
charge: 0.196528 0.254713 -0.180595 0.025221 0.211488 -0.538162 0.078390 -0.023790 -0.023794
chargesum: -0.00000
1716.lowfreq: -1297.5402 -39.4595 -20.7526 -0.0031 0.0023 0.0024 10.6972 23.0468 58.4892
frequency: -1297.5398 -25.5585 57.3331 62.7109 167.9097 198.0705 217.7349 341.8249 354.5085 411.9402 630.8405 631.3037 694.2796 708.9561 710.5188 797.1067 837.1413 841.8522 877.7851 1013.6208 1043.1602 1067.6191 1097.9083 1151.9647 1170.7431 1184.9290 1254.7973 1312.2633 1407.3328 1439.5483 1463.4236 1486.2073 1520.2103 1564.4657 1612.2151 1686.9795 1963.6080 3074.5773 3159.2089 3174.2996 3283.5717 3291.1446
redmass: 1.1330 1.0933 5.3782 5.5824 6.1234 3.8584 9.6246 7.6467 4.7975 5.3150 4.5793 2.8057 2.9196 1.8791 4.6889 1.4860 4.8392 1.4511 2.5396 1.4910 2.4626 3.8373 1.5528 1.2925 1.0486 1.7422 1.3539 5.9087 4.8332 3.8723 1.2600 1.0360 1.1632 3.6886 2.6607 1.3377 1.0858 1.0327 1.1068 1.1059 1.1001 1.1016
irintensity: 4586.8244 0.0860 2.4521 0.0051 2.7969 0.6061 5.2268 0.4837 5.6103 2.6597 74.1347 29.2816 0.6518 171.5136 57.8667 23.3362 209.4600 40.4288 207.8955 21.6930 67.1335 12.9038 1.5032 3.2116 28.1230 114.3004 16.5583 11.0301 11.7194 35.9651 14.0021 15.9695 32.4371 125.0131 5.0655 239.5567 720.5999 30.6856 7.5476 6.5241 4.2953 0.8793
temp: 298.150 k
press: 1.00000 atm
elementType: 6 6 1 6 7 7 5 1 1 1 1 1 6 1 17 17
symmnumber: 1
zpe: 292879.4 jmol-1
zpe.correction: 0.111552 hartree
zpe.thermalcorrener: 0.119880 hartree
zpe.thermalcorrenthalpy: 0.120824 hartree
zpe.thermalcorrgfe: 0.076393 hartree
zpe.sumelectzpe: -1211.315636 hartree
zpe.sumelectthermal: -1211.307308 hartree
zpe.sumelectthermalent: -1211.306364 hartree
zpe.sumelectthermalfe: -1211.350796 hartree
dipole: 10.4110 0.7589 0.0001
dipole: 10.4386
quadrupole: -67.7302 -62.7599 -75.0263
quadrupole: -3.8318 -0.0003 0.0004
quadrupole: 0.7753 5.7456 -6.5208 -3.8318 -0.0003 0.0004
hfenergy: -1211.4271881 hartree
pointgroup: C01 [X(C4H7B1Cl2N2)]
dipole: 4.0960013 0.2985846 0.0000478 debye
dipolederiv: 0.6458114 -0.1913621 -0.000171 -0.1698995 0.2370941 0.0000606 0.0000868 -0.000044 0.2333322 0.2141207 -0.2044358 0.0000084 0.1891055 -0.0013803 0.0000136 0.0000704 -0.000063 -0.1031616 0.0890632 0.0241464 -0.0000086 0.0137427 0.0494446 -0.0000035 -0.0000163 0.0000125 0.1955351 -0.4728079 0.0879569 0.000002 -0.2566697 -0.2526507 -0.0000502 0.0000164 -0.0000045 -0.2847363 -0.8874743 0.3221098 0.0000497 0.333841 -0.0831544 -0.000032 -0.0003231 0.0001143 -0.1560233 -1.6791695 -0.0343064 0.000064 0.3364391 -0.3577717 0.000043 0.0000239 0.0000215 -0.2351265 1.4315525 0.2779871 0.0000161 0.7455239 1.15209 -0.0000665 0.0000539 -0.0000509 1.9529902 2.0942802 0.3994795 0.0000011 0.0385963 0.1034517 -0.0000066 -0.0000358 -0.0000252 0.1121837 -0.6694049 -0.2415505 -0.0000118 -0.5581816 -0.5887106 -0.0000267 -0.0000213 -0.0000229 -0.1072432 -0.0188124 0.0202601 -0.03236 0.0820885 0.03815 -0.0644316 0.0449844 -0.0907128 -0.0209767 -0.0048994 0.0076619 -0.0000202 -0.1007349 -0.0435644 -0.0002414 -0.0000824 -0.0001452 0.1119871 -0.0185535 0.019971 0.0324942 0.0820919 0.0378121 0.0646361 -0.0447289 0.0908803 -0.0205249 0.5428093 -0.2380366 -0.0000333 -0.237065 0.3272881 0.000008 0.0001074 0.0000189 0.0989795 0.031568 -0.0319731 -0.0000222 -0.0106978 0.1124959 0.000003 -0.0000978 -0.0000644 0.1888082 -0.6490493 -0.1089866 0.34039 -0.2441423 -0.3653363 0.1988414 0.4666813 0.2015245 -0.9829782 -0.649034 -0.1089216 -0.3403986 -0.244038 -0.365258 -0.1987472 -0.4667188 -0.2014391 -0.9830453 unknown
polarizability: 145.2769049|5.3849944|105.5987641|-0.0012722|0.0000953|93.4297273 unknown
InChI: InChI=1/C4H7BCl2N2/c1-9-2-4(5(6)7)8-3-9/h2-3,5,8H,1H3
charge 0 multiplicity 1
16 atoms
C  3.23643726 -0.63228972 -0.00009239
C  0.72843073 -0.90685983 0.00002439
H  0.78025067 -1.98287571 0.00003225
C  -0.32940999 -0.04635538 -0.0000011
N  1.87011092 -0.13251687 0.00007272
N  0.18126765 1.23095817 0.00002709
B  -1.91545791 0.0237254 -0.00000366
H  -1.06130726 1.73991584 0.00007867
H  -1.99954234 1.5030286 0.00009118
H  3.41125275 -1.23359151 -0.89226486
H  3.92261244 0.2128063 0.00140774
H  3.41047552 -1.23603984 0.89056963
C  1.49697628 1.16019047 0.0000612
H  2.18937022 1.98640409 0.00006314
Cl -2.77414442 -0.47880344 1.53142177
Cl -2.77412267 -0.47858258 -1.53151618
