program: Gaussian 16
title: cl_quinoline
version: AS64L-G16RevC.02
method: RwB97XD
basis: GenECP
operation: Freq
keyword: #N
keyword: Geom=AllCheck
keyword: Guess=TCheck
keyword: SCRF=Check
keyword: GenChk
keyword: RwB97XD/GenECP
keyword: Freq
converged: YES YES YES YES
title: Mulliken charges:
elementType: C C C C C C H C H H C C H H H N B H H Cl Cl
charge: -0.756730 0.996248 -1.016595 0.423133 -0.293241 -0.445480 0.255976 0.618306 0.213106 0.245331 -0.734064 0.042441 0.266834 0.251675 0.262830 0.159010 -0.702749 0.233676 0.100055 -0.076525 -0.043235
chargesum: 0.00000
title: Mulliken charges with hydrogens summed into heavy atoms:
elementType: C C C C C C C C C N B Cl Cl
charge: -0.500755 0.996248 -1.016595 0.423133 -0.080135 -0.200150 0.885140 -0.482389 0.305272 0.392686 -0.602695 -0.076525 -0.043235
chargesum: -0.00000
1716.lowfreq: -843.2324 -0.0035 -0.0034 -0.0033 1.4733 9.0938 18.1825 39.5058 81.4288
frequency: -843.2251 34.9912 81.3568 158.2190 174.5329 181.0489 190.1561 282.9868 333.2183 433.5896 434.9954 474.9587 510.4515 544.3903 565.0717 633.9991 649.4316 663.2594 729.7460 768.8989 783.9558 811.6314 834.7040 848.3172 865.2000 908.4457 960.2561 989.4917 1013.7967 1018.5511 1025.9521 1066.5543 1087.3305 1099.8793 1127.6876 1166.1042 1202.0188 1247.7326 1280.8506 1290.7494 1361.5991 1411.8838 1443.6305 1468.1632 1501.6820 1529.3351 1563.5136 1663.1912 1665.5405 1690.9588 2459.2685 3188.8239 3196.9237 3198.4024 3202.2838 3214.4083 3231.5912
redmass: 1.1806 9.9952 8.5694 5.8107 4.3977 10.9226 7.2259 4.8035 14.3612 4.2312 4.6401 3.1547 6.0870 7.3663 4.2197 6.4255 3.6764 4.5727 1.9115 5.6398 1.2161 2.4952 5.2254 1.6750 2.7317 4.0374 1.3836 1.3974 1.3216 1.3479 1.3550 2.9714 2.6576 2.2521 1.0726 1.3072 1.3270 2.0138 1.6129 2.0334 3.0676 2.4340 4.5053 2.0269 1.6648 1.6677 3.1007 5.3878 7.4125 6.7911 1.0278 1.0884 1.0911 1.0898 1.0930 1.0979 1.0974
irintensity: 3285.0973 0.1220 0.9281 2.3175 5.0286 5.4646 11.0704 1.9150 18.1560 2.5677 17.1375 0.6720 22.0810 1.3323 18.3588 106.9841 16.3074 21.2773 105.3488 17.7009 13.3996 22.2370 12.8990 216.7714 77.0622 71.5736 3.8920 1.6417 50.8775 2.3838 1.2935 5.8937 0.5016 0.3663 26.4883 14.8507 32.6887 6.1473 0.9035 53.1508 11.6734 17.4601 25.2435 5.5327 24.6192 21.6258 89.8000 17.2710 71.3080 56.2993 2483.8914 1.9620 7.9333 1.6087 9.1359 16.9701 5.6711
temp: 298.150 k
press: 1.00000 atm
elementType: 6 6 6 6 6 6 1 6 1 1 6 6 1 1 1 7 5 1 1 17 17
symmnumber: 1
zpe: 391571.9 jmol-1
zpe.correction: 0.149142 hartree
zpe.thermalcorrener: 0.159629 hartree
zpe.thermalcorrenthalpy: 0.160573 hartree
zpe.thermalcorrgfe: 0.111424 hartree
zpe.sumelectzpe: -1347.659518 hartree
zpe.sumelectthermal: -1347.649031 hartree
zpe.sumelectthermalent: -1347.648087 hartree
zpe.sumelectthermalfe: -1347.697236 hartree
dipole: 8.7237 0.4648 -0.5621
dipole: 8.7541
quadrupole: -94.9257 -76.0215 -98.9964
quadrupole: -6.8441 0.7693 2.2393
quadrupole: -4.9445 13.9597 -9.0152 -6.8441 0.7693 2.2393
hfenergy: -1347.8086599 hartree
pointgroup: C01 [X(C9H8B1Cl2N1)]
dipole: 3.4321659 0.182863 -0.2211426 debye
dipolederiv: 0.1938956 -0.0889161 0.0114734 -0.0151463 -0.0775789 0.0095628 0.0020271 -0.0105688 -0.1058257 -0.3702946 0.0336202 -0.0143573 -0.0229602 -0.3524205 -0.0011602 -0.0284333 -0.0101195 -0.2866211 0.2219583 -0.3867464 -0.0136892 0.0583217 0.0259857 0.0096045 -0.0057512 0.0121251 0.1238869 -0.4732245 0.2562025 -0.0018735 -0.2233602 0.0451941 -0.0024407 -0.0118866 0.0032418 0.0391361 0.0115006 0.0408002 0.0133573 0.0228481 0.0835217 0.0106848 0.0076127 0.0040315 -0.1526683 -0.1444752 0.109391 -0.000756 0.0550618 0.1695866 0.0059338 -0.0028693 0.010932 -0.1214372 -0.0424241 0.0724476 0.0000027 0.0545267 0.0803662 0.0036608 0.0031996 0.0032105 0.13013 0.329203 -0.1749375 0.0031346 -0.0330275 0.4704389 0.0176826 0.008094 0.0120748 -0.068931 -0.0240009 -0.0946983 -0.007268 -0.0525371 0.0232315 -0.0057119 -0.004268 -0.0065517 0.1548915 0.0820524 0.0206069 -0.0009757 0.0136594 -0.0993862 -0.0050585 -0.0023671 -0.0074469 0.1543069 -0.0532063 -0.2732492 -0.0035666 -0.0200497 -0.6231219 -0.0170751 0.0181977 -0.0351891 -0.1632672 0.4129501 0.4642633 0.0167608 -0.1711204 0.4304812 0.0132482 -0.0115217 0.0225806 0.047969 -0.0144529 -0.0531626 -0.0055989 -0.0939751 0.0458773 -0.0053075 -0.0116934 -0.0018355 0.1403517 -0.0402494 0.0675626 -0.0029298 0.0513384 0.0608823 -0.0023995 -0.0020121 0.0007956 0.1664073 0.079635 -0.0065936 -0.0021817 0.0478211 -0.0568456 -0.0088017 -0.0073406 -0.0067468 0.1333635 -1.5309573 -0.168802 -0.0496867 -0.0862773 -0.2706275 -0.002693 -0.1342469 0.0058999 -0.1879286 1.6285966 0.0940398 0.1088774 -0.3031745 0.8993519 -0.1822883 -0.0859104 -0.186518 1.8084953 2.178523 0.0944466 0.0625316 0.2456924 0.0271197 -0.035532 0.2722408 -0.0271831 0.0447127 -0.9309881 0.1292216 0.0477292 0.4264173 -0.2368388 -0.0626887 0.04734 -0.0462272 -0.0675921 -0.6012589 -0.1346803 0.2615871 -0.1043423 -0.3540876 0.165102 0.4490881 0.1997129 -1.0070104 -0.9127822 -0.0008162 -0.4225704 0.1502834 -0.29113 0.0956776 -0.4994993 0.063782 -0.7823695 unknown
polarizability: 225.765834|-15.9599282|196.1155307|2.8777541|-1.1612791|111.676212 unknown
InChI: InChI=1/C9H7BCl2N.H/c11-10(12)8-5-1-3-7-4-2-6-13-9(7)8;/h1-6,10H;
charge 0 multiplicity 1
21 atoms
C  -1.06466062 1.74144179 -0.01762808
C  -0.92634419 0.37419318 -0.04486779
C  0.39880713 -0.14184303 -0.0341813
C  1.5321805 0.70133362 0.01640734
C  1.33011595 2.10193982 0.05299489
C  0.05618619 2.60301575 0.03156777
H  -2.05779751 2.17856944 -0.03120737
C  2.80241859 0.08083624 0.02964082
H  2.18999893 2.76143744 0.09686655
H  -0.10305554 3.67485933 0.05593334
C  2.90032766 -1.28608385 -0.01296266
C  1.72079192 -2.05133169 -0.08009508
H  3.69396528 0.69758686 0.07221976
H  3.86066286 -1.7846979 -0.0034385
H  1.75572669 -3.1342032 -0.13235599
N  0.53475258 -1.49230038 -0.08702948
B  -2.16014439 -0.62864183 -0.03158947
H  -0.86361565 -1.89239051 -0.26256357
H  -1.7336014 -1.97898187 -0.41193085
Cl -2.86086391 -0.94777559 1.63501949
Cl -3.41599775 -0.35929959 -1.33473685
