program: Gaussian 16
title: MeQHBCN2 TS1
version: ES64L-G16RevC.01
method: RwB97XD
basis: GenECP
operation: Freq
keyword: #N
keyword: Geom=AllCheck
keyword: Guess=TCheck
keyword: SCRF=Check
keyword: GenChk
keyword: RwB97XD/GenECP
keyword: Freq
converged: YES YES YES YES
title: Mulliken charges:
elementType: C C H C N N N B H H H H H C N C N
charge: -0.395459 -0.334138 0.275533 -0.099687 0.324360 -0.311043 -0.028551 0.377767 0.297295 0.115328 0.218432 0.218309 0.207541 -0.149078 -0.284020 -0.148343 -0.284245
chargesum: -0.00000
title: Mulliken charges with hydrogens summed into heavy atoms:
elementType: C C C N N N B C N C N
charge: 0.248822 -0.058604 -0.099687 0.324360 -0.311043 0.268744 0.493095 -0.149078 -0.284020 -0.148343 -0.284245
1716.lowfreq: -737.9038 -7.6281 -0.0005 0.0004 0.0006 7.9917 17.9659 60.0299 71.2212
frequency: -737.9037 60.0255 70.7763 81.3081 106.8440 130.0337 189.6951 301.3586 310.1467 336.4802 406.3207 455.9309 457.2197 519.4352 666.8021 673.7998 699.1445 734.6244 735.5436 850.0118 935.4777 1001.8694 1036.5822 1046.0025 1077.3614 1087.3789 1122.3141 1157.0811 1184.4270 1313.5649 1337.3056 1387.1461 1454.8526 1487.8249 1489.6810 1517.2774 1614.2461 1647.5492 2363.6498 2365.9160 2488.6964 3084.4843 3171.6860 3198.8113 3301.2034
redmass: 1.1683 6.5016 1.0471 6.8419 11.0272 7.2322 3.9471 4.2076 7.1336 5.9726 7.8503 8.8968 4.7661 12.2882 3.5676 5.4856 1.2834 5.3265 6.0163 1.4432 8.1623 1.0718 1.3296 6.0669 1.6883 4.7010 3.1886 1.3349 1.7380 6.4451 5.7765 4.8378 1.3978 1.2273 1.5299 1.4645 3.3262 1.2476 12.4194 12.7129 1.0257 1.0328 1.1072 1.1056 1.1027
irintensity: 1926.5931 0.2652 0.0826 11.5250 14.6485 13.6281 2.9038 28.4990 0.6597 0.4544 0.0889 2.1199 8.9066 1.7220 9.8920 24.3973 14.2441 27.2243 16.5272 29.3830 134.1304 22.7097 28.0468 120.4317 2.2338 16.4722 108.0551 0.1684 95.9820 15.1221 23.0905 1.1347 5.6316 18.3814 16.3215 8.7053 24.7580 116.6498 8.2986 6.0707 1679.9904 17.8423 4.0307 0.2750 6.2719
temp: 298.150 k
press: 1.00000 atm
elementType: 6 6 1 6 7 7 7 5 1 1 1 1 1 6 7 6 7
symmnumber: 1
zpe: 303001.5 jmol-1
zpe.correction: 0.115407 hartree
zpe.thermalcorrener: 0.125769 hartree
zpe.thermalcorrenthalpy: 0.126714 hartree
zpe.thermalcorrgfe: 0.078275 hartree
zpe.sumelectzpe: -492.503012 hartree
zpe.sumelectthermal: -492.492649 hartree
zpe.sumelectthermalent: -492.491705 hartree
zpe.sumelectthermalfe: -492.540144 hartree
dipole: 8.0530 4.0230 -1.8233
dipole: 9.1848
quadrupole: -78.9751 -90.8114 -83.5946
quadrupole: -25.9983 12.4359 2.6305
quadrupole: 5.4853 -6.3510 0.8658 -25.9983 12.4359 2.6305
hfenergy: -492.6184188 hartree
pointgroup: C01 [X(C5H6B1N5)]
dipole: 3.1683044 1.5827768 -0.7173317 debye
dipolederiv: 0.6190387 0.1287809 -0.041606 0.1488341 0.1944997 0.0239273 -0.0755021 0.0200634 0.1992529 0.1998926 -0.1244963 0.0754594 0.16433 -0.0182246 -0.0037023 -0.0852606 -0.0138341 -0.0311415 0.08917 0.0186644 -0.0127778 0.0096464 0.1340385 0.034009 -0.0068088 0.0338543 0.1795674 -0.2725823 0.1141288 -0.0651322 -0.14299 -0.39233 0.0949831 0.0726563 0.1007089 -0.258925 -0.7210175 -0.2241372 0.0915787 -0.0659171 0.1390826 -0.1081499 0.0360116 -0.1039463 -0.0031431 0.1859714 -0.2246841 0.1288235 -0.1237331 -0.3584148 0.1421711 0.0709987 0.1326816 -0.1481207 -1.0139631 -0.2504057 0.1017652 -0.3242381 -0.1586889 -0.0386658 0.1441962 -0.0305199 -0.1803015 0.7941916 -0.070266 0.0229336 0.2086171 1.2600544 -0.0105447 -0.1231972 -0.0199677 1.2348468 1.0839902 0.8230451 -0.3990145 0.6950833 0.7007532 -0.2990329 -0.3330987 -0.2957313 0.2317153 -0.1154732 -0.0759331 0.0359555 -0.3137811 -0.567089 0.2899348 0.1617506 0.2975496 -0.1459771 0.052538 0.0405432 -0.0330502 -0.0408757 0.0331569 0.0551441 0.0187794 0.0596867 0.0830594 -0.0362399 -0.0447871 0.0205927 -0.0389864 0.1011987 -0.0022237 -0.0604538 -0.0259725 -0.0398288 -0.0295858 -0.035645 0.0212658 0.0464291 -0.0051171 -0.069084 0.0501192 -0.0508635 0.0790215 -0.0843363 -0.0088254 0.0924467 -0.0834715 -0.1316793 0.0002556 0.1056934 0.0055113 -0.366675 -0.3382026 0.0003459 -0.0022711 0.0196234 -0.3083677 -0.0037656 0.0559162 0.0217763 -0.3200104 -0.0793571 -0.0692115 -0.0360791 -0.1227368 -0.2969677 -0.113933 0.0177627 -0.1148038 -0.207312 -0.3340349 0.002883 -0.0008901 -0.0358337 -0.3259047 0.008677 -0.0495632 -0.0161929 -0.3060284 unknown
polarizability: 123.64108|20.5182386|111.3335429|-9.7128418|-5.911339|101.5294506 unknown
InChI: InChI=1/C5H5BN5.H/c1-11-2-5(9-10-11)6(3-7)4-8;/h2,6H,1H3;
charge 0 multiplicity 1
17 atoms
C  1.59952077 -0.10027321 -0.04522656
C  -0.29290953 -1.6118436 0.67173341
H  0.34309728 -2.37263346 1.09100935
C  -1.65245386 -1.48645651 0.56255846
N  0.2044259 -0.48945151 0.097713
N  -0.75902044 0.30369249 -0.34899886
N  -1.86989816 -0.30046714 -0.0671891
B  -3.03856988 -2.18060941 0.8806413
H  -3.33212708 -0.65880191 0.07247048
H  -3.9508291 -1.22761408 0.35205226
H  1.62642033 0.81123915 -0.6370886
H  2.03280696 0.08232399 0.93762765
H  2.14663688 -0.89097272 -0.55681181
C  -3.49740281 -2.22635996 2.37884573
N  -3.80587077 -2.25022477 3.48808295
C  -3.42127697 -3.44853612 0.0421106
N  -3.67327467 -4.38053826 -0.58558365
