program: Gaussian 16
title: MeQHBFA TS1
version: ES64L-G16RevC.01
method: RwB97XD
basis: GenECP
operation: Freq
keyword: #N
keyword: Geom=AllCheck
keyword: Guess=TCheck
keyword: SCRF=Check
keyword: GenChk
keyword: RwB97XD/GenECP
keyword: Freq
converged: YES YES YES YES
title: Mulliken charges:
elementType: C C H C N N N B H H H H H C O O H C O O H
charge: -0.396941 -0.356132 0.277613 -0.252063 0.319964 -0.431662 0.126511 0.362054 0.333802 -0.014216 0.215854 0.213916 0.208214 -0.201516 -0.295307 -0.142565 0.309009 -0.126183 -0.285570 -0.167374 0.302592
chargesum: 0.00000
title: Mulliken charges with hydrogens summed into heavy atoms:
elementType: C C C N N N B C O O C O O
charge: 0.241043 -0.078519 -0.252063 0.319964 -0.431662 0.460313 0.347837 -0.201516 -0.295307 0.166444 -0.126183 -0.285570 0.135218
chargesum: -0.00000
1716.lowfreq: -1003.0498 -11.3234 -5.2007 -0.0010 -0.0007 -0.0006 7.6028 19.3940 34.1902
frequency: -1003.0498 18.6592 34.1086 53.7662 65.2474 82.1340 102.3980 117.6546 186.2622 272.9008 290.6312 319.7213 344.6607 429.9035 511.2326 562.6363 608.6327 655.5928 663.3500 678.9465 706.0860 716.9093 742.5394 756.6811 784.1885 848.3406 944.9923 982.3126 1073.4977 1075.8549 1077.6084 1091.9640 1157.2587 1160.4768 1170.7463 1177.9320 1212.5519 1319.0065 1329.7466 1342.3841 1346.3531 1392.6173 1455.7390 1487.9692 1488.8831 1516.2701 1619.5237 1767.6041 1791.5645 1804.0376 2182.7255 3082.9693 3168.9863 3196.9975 3304.7124 3795.2214 3795.7371
redmass: 1.1224 10.9854 11.6955 5.2556 1.0876 5.6809 6.7436 6.3983 3.7377 4.7818 6.6877 9.1505 7.6498 3.6294 2.1958 1.6947 2.1348 2.3919 3.1773 1.8072 2.9327 3.4238 3.7357 4.0493 4.9138 1.4187 8.4732 5.8603 1.0949 1.7339 4.3230 2.9921 1.3304 2.1060 2.0860 1.9955 1.6015 5.6765 2.5736 2.9382 3.2669 4.6286 1.3863 2.1514 1.0418 1.3893 5.8318 1.2280 6.7348 5.6955 1.0428 1.0328 1.1071 1.1054 1.1023 1.0641 1.0642
irintensity: 2646.0892 3.2900 2.1394 1.8674 0.0161 7.0521 2.5688 2.2598 0.5651 2.5984 0.6123 8.3600 2.4579 8.6854 1.7436 53.1127 161.2859 138.8771 14.6879 56.8127 5.9436 13.8785 0.9125 24.4028 116.7616 25.8390 72.9613 41.6000 8.4220 2.1537 5.7480 5.0380 3.9505 307.1434 334.3429 136.7765 69.6619 14.5543 5.2902 60.6938 21.4370 4.6886 5.9308 15.4515 17.1056 6.0849 4.3953 90.6750 659.0765 204.6522 1064.2034 20.7867 4.8164 0.4773 5.5127 87.5279 68.6158
temp: 298.150 k
press: 1.00000 atm
elementType: 6 6 1 6 7 7 7 5 1 1 1 1 1 6 8 8 1 6 8 8 1
symmnumber: 1
zpe: 387993.4 jmol-1
zpe.correction: 0.147779 hartree
zpe.thermalcorrener: 0.160576 hartree
zpe.thermalcorrenthalpy: 0.161521 hartree
zpe.thermalcorrgfe: 0.105226 hartree
zpe.sumelectzpe: -685.134714 hartree
zpe.sumelectthermal: -685.121916 hartree
zpe.sumelectthermalent: -685.120972 hartree
zpe.sumelectthermalfe: -685.177266 hartree
dipole: 6.1314 1.1944 0.0251
dipole: 6.2467
quadrupole: -83.5882 -76.9057 -82.8811
quadrupole: -11.1203 -6.8543 3.5319
quadrupole: -2.4632 4.2193 -1.7561 -11.1203 -6.8543 3.5319
hfenergy: -685.282493 hartree
pointgroup: C01 [X(C5H8B1N3O4)]
dipole: 2.4122794 0.4699065 0.0098815 debye
dipolederiv: 0.6229445 0.1188171 -0.0384631 0.1445137 0.1972088 0.0239521 -0.0640813 0.0241118 0.1980398 0.1541148 -0.16111 0.1108373 0.1710924 -0.0325094 -0.0042347 -0.0913592 -0.0319549 -0.0269776 0.0899787 0.0172304 -0.0150867 0.0122851 0.1362475 0.0357274 -0.0167994 0.0385255 0.1742814 -0.1425517 0.2022997 -0.1028365 -0.0447487 -0.2883847 0.0932681 -0.0006175 0.0842089 -0.1802081 -0.7209826 -0.2120367 0.0933825 -0.0794159 0.1444598 -0.1300001 0.0174624 -0.1364508 0.0221621 0.198121 -0.204603 0.133136 -0.1105056 -0.3637474 0.1461503 0.0877453 0.1560407 -0.159215 -1.0731923 -0.273195 0.1336839 -0.3816481 -0.1902241 -0.0048535 0.1813714 -0.0155764 -0.1935447 0.4368507 -0.1903067 0.0788212 0.0387239 0.7046773 -0.2591269 -0.0253072 -0.2512667 0.4246489 1.1652176 0.7799559 -0.4471914 0.693199 0.6611403 -0.3116576 -0.3659929 -0.2860671 0.2757586 -0.1620731 -0.0554401 0.0365777 -0.2988476 -0.4898246 0.2982605 0.1800884 0.3075773 -0.1607167 0.051464 0.0394514 -0.0318786 -0.0437091 0.0282348 0.0558788 0.0212903 0.0623982 0.0812249 -0.0342206 -0.0425885 0.0197362 -0.0366804 0.1004396 -0.0025877 -0.0660606 -0.0281929 -0.0427177 -0.0396035 -0.0325226 0.0233872 0.0521375 -0.0071987 -0.0699111 0.0513864 -0.0518868 0.0753676 1.9239441 -0.3079762 -0.0063982 -0.4437647 0.1496483 -0.1042473 -0.0187861 -0.134825 1.3116029 -0.9983505 0.0991911 -0.1199153 0.1785365 -0.4078683 0.1249647 -0.3607635 0.2284336 -1.2406623 -1.5421007 0.1743334 0.1873599 0.1941473 -0.4207817 -0.0356272 0.4692819 -0.040962 -0.5270847 0.3390203 0.0190218 -0.083317 0.0098298 0.3655143 0.040958 -0.0206169 0.0240887 0.2245857 1.0650193 -0.3785236 0.8159877 -0.2684825 1.4104623 0.0645172 0.913678 0.0776995 0.8987358 -0.9541579 0.0861892 -0.5290176 -0.2087518 -0.7673314 -0.2361518 -0.6745251 -0.0485766 -0.9681669 -0.6844135 0.3684307 -0.1775752 0.4279259 -1.2674069 0.2961697 -0.149538 0.0877441 -0.4700816 0.3049715 -0.0466184 -0.08123 -0.0058365 0.3372442 -0.0214488 -0.0678562 -0.0650695 0.2829675 unknown
polarizability: 144.2976076|13.1010836|113.2505025|-0.1306547|-12.0520756|106.2652541 unknown
InChI: InChI=1/C5H7BN3O4.H/c1-9-2-3(7-8-9)6(4(10)11)5(12)13;/h2,6,10,12H,1H3;
charge 0 multiplicity 1
21 atoms
C  1.59790775 -0.12382404 -0.03755254
C  -0.30748413 -1.60116664 0.71718489
H  0.31961369 -2.33150628 1.19872784
C  -1.66508289 -1.49347758 0.56884566
N  0.20108547 -0.50799594 0.09342799
N  -0.75021282 0.25554851 -0.42168489
N  -1.86391586 -0.34559206 -0.13138766
B  -3.0802431 -2.13551773 0.87333344
H  -3.26050066 -0.63072745 -0.02967192
H  -3.91812815 -1.19615378 0.29593966
H  1.6337634 0.78899692 -0.62706699
H  2.02331295 0.05512824 0.94945131
H  2.14842875 -0.91491551 -0.54546733
C  -3.52379573 -2.18262643 2.42418276
O  -2.77440709 -2.44598165 3.33595518
O  -4.83230379 -1.93806871 2.638434
H  -4.9985915 -2.02242304 3.58759292
C  -3.47651427 -3.46216539 0.04189222
O  -4.3096203 -3.55032791 -0.82862273
O  -2.74152708 -4.5304506 0.4216851
H  -3.02699272 -5.28848279 -0.1069522
