program: Gaussian 16
title: cyclo_biphenylene
version: AS64L-G16RevC.02
method: RwB97XD
basis: GenECP
operation: Freq
keyword: #N
keyword: Geom=AllCheck
keyword: Guess=TCheck
keyword: SCRF=Check
keyword: GenChk
keyword: RwB97XD/GenECP
keyword: Freq
converged: YES YES YES YES
title: Mulliken charges:
elementType: C C C C C C C H C H H C H C H C C H N C H H H C H H H H H B C H C H C H H C H H C H H H H
charge: 0.339693 0.029884 -0.050807 0.158163 -0.330839 0.097544 -0.305217 0.214037 -0.507821 0.239219 0.209158 -0.449532 0.218789 -0.187541 0.230821 -0.245305 0.354756 0.173827 0.035989 -0.396403 0.199558 0.221944 0.190569 -0.345301 0.203085 0.177176 0.222679 -0.017043 0.116787 -0.980849 -0.334292 0.203183 -0.167929 0.193589 -0.373599 0.192079 0.192268 -0.197353 0.120496 0.190045 -0.473220 0.143402 0.178570 0.170226 0.145515
chargesum: -0.00000
title: Mulliken charges with hydrogens summed into heavy atoms:
elementType: C C C C C C C C C C C C N C C B C C C C C
charge: 0.339693 0.029884 -0.050807 0.158163 -0.116803 0.097544 -0.065998 -0.298663 -0.230743 0.043280 -0.071479 0.354756 0.018946 0.215668 0.257640 -0.864061 0.039117 0.171175 0.010748 0.113188 -0.151248
chargesum: 0.00000
1716.lowfreq: -759.0512 -7.4328 -0.0004 -0.0002 -0.0001 5.0789 8.5586 25.9293 66.4798
frequency: -759.0499 25.8805 66.4279 78.5109 94.9477 102.7243 111.5447 143.5748 159.6329 181.7428 203.6892 215.4592 220.2033 243.7529 282.3821 296.0166 306.1075 337.0910 348.9895 373.3964 391.8965 409.0234 455.3893 464.4847 478.3003 493.8726 536.3901 562.3347 584.1043 603.7373 637.8571 652.8983 682.1663 694.1124 741.6623 746.6453 748.6103 756.6742 781.7163 796.7733 820.0591 834.4330 835.0160 866.1967 876.8806 906.8565 918.8819 929.0395 929.3250 934.8801 976.2274 988.1317 997.2746 1000.7577 1007.4249 1031.4602 1048.3387 1057.7953 1063.2817 1068.8417 1087.0158 1091.1536 1111.7320 1116.7077 1145.9733 1154.8731 1166.9273 1183.6178 1189.7413 1199.7206 1206.2273 1227.3468 1236.0322 1248.1542 1251.7107 1267.5495 1291.6662 1303.0287 1317.9834 1320.4225 1332.3779 1362.4177 1366.1136 1381.3943 1384.5813 1409.2809 1437.5886 1447.1372 1450.9248 1467.6378 1472.2478 1475.2434 1486.7740 1490.8937 1492.6458 1495.8041 1497.1610 1501.4334 1504.9939 1507.9326 1519.6805 1521.0155 1654.3725 1668.5862 1690.3208 1754.8629 2243.6659 3007.9033 3013.4788 3014.4267 3015.8013 3022.6800 3029.5623 3038.5375 3055.7637 3059.1750 3061.3578 3064.9362 3072.6136 3117.3940 3117.8454 3149.7569 3164.1511 3178.2508 3187.6932 3195.0383 3202.9195 3210.9551 3216.0183
redmass: 1.2624 4.0708 3.4908 3.9141 4.0739 3.0408 2.9888 3.0574 2.9664 3.9143 1.9962 1.2850 2.2820 1.2721 2.6229 2.9086 2.9750 3.0237 1.9889 4.3792 3.1988 3.4966 3.3199 4.3564 2.6173 1.9926 3.7495 3.4554 3.8050 5.5061 3.9805 4.2915 2.5252 1.4441 3.5078 2.5907 4.2892 1.5869 1.4477 1.7342 2.4715 2.1428 4.6206 1.4956 2.4232 1.4461 2.1806 1.3856 1.8070 1.3973 3.1500 2.2573 1.3174 1.3333 6.2138 1.7300 2.4512 2.1098 1.6022 1.2968 1.7835 1.6900 1.7486 1.4345 1.2869 2.0098 2.5266 1.6700 1.5732 1.8828 1.7190 2.5755 1.7927 2.0418 1.7281 1.9203 1.2468 2.0837 1.6664 1.6316 1.3101 1.3583 1.4671 1.4895 1.5066 2.3275 2.3812 1.1543 1.1289 1.0906 1.0873 1.1836 1.0738 1.1303 1.1721 1.0561 1.5089 1.6593 1.1646 1.1717 1.3449 5.4218 8.0157 7.4687 9.0778 9.3936 1.0397 1.0608 1.0667 1.0622 1.0616 1.0634 1.0417 1.0371 1.0980 1.1002 1.0975 1.1002 1.1017 1.1000 1.0962 1.1047 1.1036 1.0862 1.0868 1.0925 1.0931 1.0960 1.0963
irintensity: 3422.5437 0.1104 0.1367 4.3402 0.6929 4.8444 0.2353 2.3582 14.7154 2.4039 4.4013 1.0176 2.9071 3.7709 0.4520 0.1552 0.9306 1.8457 1.0341 1.2322 1.1286 5.3586 3.4114 0.5578 1.5886 16.7029 2.6220 3.8432 17.4693 2.4020 17.2217 4.5555 14.9743 0.4502 12.3927 45.2596 2.7730 0.8013 1.1625 73.7193 1.4947 9.5290 2.2945 33.8720 27.0287 4.6940 27.4455 7.2223 21.5210 0.0427 46.5908 56.0876 0.7601 1.2634 14.3558 4.6063 3.8460 5.7268 15.3213 8.3844 23.1099 8.3974 14.3872 7.1082 7.4436 24.8923 19.3866 19.2059 24.8885 4.3490 22.3498 16.4297 4.9654 15.1728 3.9696 79.9956 0.2107 13.6196 8.1865 12.0517 8.2244 1.2907 10.0676 2.5738 0.5326 7.5049 60.5252 17.7190 44.9408 10.0382 3.0616 0.0942 6.7773 6.4073 9.5085 13.4985 4.1679 3.0877 26.1518 14.4908 47.6820 0.3115 1.6691 3.3675 8.5954 13.2060 2760.3771 45.3242 38.3847 59.9272 19.6414 39.0185 35.8066 43.7107 129.5258 7.7252 114.8485 72.7882 124.0297 30.9271 10.5641 14.3363 13.7729 2.9092 3.0036 28.0307 12.8088 28.7788 20.2000
temp: 298.150 k
press: 1.00000 atm
elementType: 6 6 6 6 6 6 6 1 6 1 1 6 1 6 1 6 6 1 7 6 1 1 1 6 1 1 1 1 1 5 6 1 6 1 6 1 1 6 1 1 6 1 1 1 1
symmnumber: 1
zpe: 1007451.6 jmol-1
zpe.correction: 0.383718 hartree
zpe.thermalcorrener: 0.402300 hartree
zpe.thermalcorrenthalpy: 0.403244 hartree
zpe.thermalcorrgfe: 0.337780 hartree
zpe.sumelectzpe: -817.533719 hartree
zpe.sumelectthermal: -817.515138 hartree
zpe.sumelectthermalent: -817.514193 hartree
zpe.sumelectthermalfe: -817.579657 hartree
dipole: -5.3587 -0.7574 0.4104
dipole: 5.4274
quadrupole: -121.3067 -118.7925 -133.4517
quadrupole: 10.5492 0.0886 0.9315
quadrupole: 3.2103 5.7245 -8.9347 10.5492 0.0886 0.9315
hfenergy: -817.9174376 hartree
pointgroup: C01[X(C19H24B1N1)]
dipole: -2.108258 -0.297968 0.1614552 debye
polarizability: 380.3790322|-6.7169115|302.0373951|-25.6120038|5.6223145|191.1766114 unknown
InChI: InChI=1/C19H22BN.2H/c1-21(2)17-11-7-9-15-14-8-6-10-16(18(14)19(15)17)20-12-4-3-5-13-20;;/h6-11H,3-5,12-13H2,1-2H3;;
charge 0 multiplicity 1
45 atoms
C  0.8081911 0.7378371 -0.20827371
C  0.73151417 2.13894742 -0.06582397
C  -0.76346686 2.02567767 0.18294811
C  -0.66243925 0.62313446 0.01382313
C  -1.95872048 2.62740682 0.45308758
C  -1.73129134 -0.21384732 0.07788429
C  -3.08108443 1.76002506 0.54673859
H  -2.07547961 3.69577621 0.58908856
C  -2.98102955 0.39381044 0.3657936
H  -4.05451585 2.18663907 0.7616279
H  -3.87452823 -0.21703298 0.44072416
C  1.84701709 2.92262702 -0.18868462
H  1.84544502 4.00158183 -0.08956127
C  3.04178529 2.21507308 -0.46503075
H  3.96312097 2.77636747 -0.58142862
C  3.08484101 0.83212185 -0.59172734
C  1.93703502 0.00199721 -0.45431333
H  4.04542782 0.37347919 -0.8035664
N  -1.54974856 -1.62885636 -0.15480249
C  -1.74814109 -2.43994741 1.0528671
H  -2.79830566 -2.4442859 1.36828841
H  -1.43409239 -3.46460544 0.84483938
H  -1.13168237 -2.03994012 1.85678178
C  -2.33565817 -2.12455789 -1.29022992
H  -2.04074636 -3.15591275 -1.49579813
H  -3.41203146 -2.09541517 -1.09028818
H  -2.11632781 -1.51402799 -2.16709249
H  -0.17075914 -1.77934172 -0.67212807
H  0.56432521 -1.88427269 -1.17719896
B  1.91143231 -1.60081134 -0.46204222
C  2.88433129 -2.40674355 -1.45468997
H  3.03571264 -1.89559132 -2.41242601
C  1.80131883 -2.27544839 0.99469874
H  1.19960481 -1.679539 1.69161069
C  3.22388298 -2.45187282 1.55482141
H  3.68861763 -1.46573663 1.69151981
H  3.19536412 -2.91828224 2.54609174
C  4.2461815 -2.64436098 -0.76800082
H  4.7777532 -1.69143115 -0.65184793
H  4.8857988 -3.27135639 -1.39982376
C  4.09905435 -3.28565136 0.61445006
H  3.65152585 -4.28276311 0.50255903
H  5.08893841 -3.43493723 1.0594791
H  2.45168587 -3.38902698 -1.68758624
H  1.33245593 -3.26733148 0.93058133
